{"text_format":"1","workbook":"xlsx","n_sheets":5,"sheets":["Assessment details","BREEAM Pre-Assessment Estimator","BREEAM Credits","Final Score and Rating","Schedule of Changes"],"not_rendered":{"charts":1,"images":4,"macros":1,"external_links":0,"defined_names":309,"comments":1,"pivot_tables":0},"unopened":[],"bounds":{"document_bytes":16777216,"sheet_cells":100000,"rows_first":2000,"rows_last":500,"rows_between":2000,"halvings":0,"cell_chars":16384,"cell_head_chars":4096},"cells_cut":0,"cells_raw":0,"read":"whole","date_system":"1900"}

{"sheet":"Assessment details","index":0,"n_rows":45,"n_cols":34,"rows_kept":45,"cut":false,"hidden":true,"merged":[[10,21,11,21],[10,22,11,22]]}
[]
[]
[null,null,"Projektinformation:",null,null,null,"Building Profile Information - BREEAM Healthcare (N/A to Europe)",null,null,"Building Profile Information - BREEAM Europe: Offices",null,null,"Building Profile Information - BREEAM Europe: Industrial",null,null,"Building Profile Information - Education (N/A to Europe)",null,null,"Building Profile Information - BREEAM Courts (N/A to Europe)",null,null,"Building Profile Information - BREEAM Prisons (N/A to Europe)",null,null,"Building Profile Information - BREEAM Europe: Retail",null,null,"Building Profile Information - BREEAM Europe: Toyota Retail Units"]
[]
[]
[null,null,"Certifieringssteg",null,null,null,"Building Type:",null,null,"Shell & Core Assessment","No",null,"Shell & Core Assessment",null,null,"Building Type",null,null,{"$f":"'BREEAM Credits'!CF15","v":"Lifts"},{"$f":"IF(COURTSlifts=\"y\",\"Yes\",\"No\")","v":"No"},null,"Building Type: ",null,null,"Shell & Core Assessment","No",null,"Development size",{"$f":"IF(RETsmall=\"y\",\"Small <500m2\",+IF(RETlarge=\"y\",\"Medium/Large ≥500m2\"))","v":false}]
[null,null,"Projekttyp:","Existing Building Fit-Out",null,null,"Building Size:",null,null,{"$f":"'BREEAM Credits'!BU15","v":"Building Heated"},{"$f":"IF(OFFheated=\"y\",\"Yes\",\"No\")","v":"Yes"},null,"Office space",{"$f":"IF(INDsmalloffice=\"y\",\"Small office space <500m2\",+IF(INDlargeoffice=\"y\",\"Medium/Large office space ≥500m2\",+IF(AND(INDlargeoffice=\"\",INDsmalloffice=\"\"),\"No\")))","v":"No"},null,{"$f":"'BREEAM Credits'!DW15","v":"Lifts"},{"$f":"IF(EDUlifts=\"y\",\"Yes\",\"No\")","v":"No"},null,{"$f":"'BREEAM Credits'!CE15","v":"Internal or external soft landscaping/planting"},{"$f":"IF(COURTSplanting=\"y\",\"Yes\",\"No\")","v":"No"},null,{"$f":"'BREEAM Credits'!CK15","v":"Food preparation and/or dining areas"},{"$f":"IF(PRIfoodprep=\"y\",\"Yes\",\"No\")","v":"No"},null,{"$f":"'BREEAM Credits'!CX15","v":"General display and sale of goods retail"},{"$f":"IF(RETgeneral=\"y\",\"Yes\",\"No\")","v":"No"},null,{"$f":"'BREEAM Credits'!DB15","v":"Building Heated"},{"$f":"IF(retheated=\"y\",\"Yes\",\"No\")","v":"No"}]
[null,null,"Manual:",null,null,null,"Patient Type:",null,null,{"$f":"'BREEAM Credits'!BY15","v":"Lifts"},{"$f":"IF(OFFlifts=\"y\",\"Yes\",\"No\")","v":"Yes"},null,{"$f":"'BREEAM Credits'!EO15","v":"Building Heated"},{"$f":"IF(INDheated=\"y\",\"Yes\",\"No\")","v":"No"},null,{"$f":"'BREEAM Credits'!DX15","v":"Fume cupboardscabinets"},{"$f":"IF(EDUfume=\"y\",\"Yes\",\"No\")","v":"No"},null,null,null,null,{"$f":"'BREEAM Credits'!CL15","v":"Cold storage plant and enclosures"},{"$f":"IF(PRIcold=\"y\",\"Yes\",\"No\")","v":"No"},null,{"$f":"'BREEAM Credits'!CY15","v":"Food retail"},{"$f":"IF(Retfood=\"y\",\"Yes\",\"No\")","v":"No"},null,{"$f":"'BREEAM Credits'!DG15","v":"Lifts"},{"$f":"IF(RETlifts=\"y\",\"Yes\",\"No\")","v":"No"}]
[null,null,null,null,null,null,null,null,null,{"$f":"'BREEAM Credits'!BZ15","v":"Escalators"},{"$f":"IF(OFFescalators=\"y\",\"Yes\",\"No\")","v":"Yes"},null,{"$f":"'BREEAM Credits'!EP15","v":"Heated Operational Area"},{"$f":"IF(INDoperational=\"y\",\"Yes\",\"No\")","v":"No"},null,{"$f":"'BREEAM Credits'!DY15","v":"Swimming pool"},{"$f":"IF(EDUswimming=\"y\",\"Yes\",\"No\")","v":"No"},null,null,null,null,{"$f":"'BREEAM Credits'!CM15","v":"Swimming pool"},{"$f":"IF(PRIpool=\"y\",\"Yes\",\"No\")","v":"No"},null,{"$f":"'BREEAM Credits'!CZ15","v":"Food preparation and service retail"},{"$f":"IF(RETfoodprep=\"y\",\"Yes\",\"No\")","v":"No"},null,{"$f":"'BREEAM Credits'!DI15","v":"Internal goods storage, warehousing and/or vehicle delivery bays/access/workshops"},{"$f":"IF(TOYOTA=\"y\",\"N/A\",+IF(RETinternalgoods=\"y\",\"Yes\",\"No\"))","v":"No"}]
[null,null,null,null,null,null,null,null,null,{"$f":"'BREEAM Credits'!BW15","v":"Food preparation area"},{"$f":"IF(OFFfoodprep=\"y\",\"Yes\",\"No\")","v":"Yes"},null,{"$f":"'BREEAM Credits'!EQ15","v":"Vehicle delivery bays/access to warehouse"},{"$f":"IF(INDwarehouse=\"y\",\"Yes\",\"No\")","v":"No"},null,{"$f":"'BREEAM Credits'!DZ15","v":"Cold Storage plant and enclosures"},{"$f":"IF(EDUcold=\"y\",\"Yes\",\"No\")","v":"No"},null,null,null,null,{"$f":"'BREEAM Credits'!CN15","v":"Lifts"},{"$f":"IF(PRIlifts=\"y\",\"Yes\",\"No\")","v":"No"},null,{"$f":"'BREEAM Credits'!DA15","v":"Service provider"},{"$f":"IF(RETservice=\"y\",\"Yes\",\"No\")","v":"No"},null,"Office space",{"$f":"IF(RETofficesmall=\"y\",\"Small office space <500m2\",+IF(RETofficelarge=\"y\",\"Medium/Large office space ≥500m2\",+IF(AND(RETofficelarge=\"\",RETofficesmall=\"\"),\"No\")))","v":"No"}]
[null,null,null,null,null,null,null,null,null,{"$f":"'BREEAM Credits'!BX15","v":"Servery/dining area"},{"$f":"IF(OFFserdin=\"y\",\"Yes\",\"No\")","v":"No"},null,{"$f":"'BREEAM Credits'!ER15","v":"Cold storage plant and enclosures"},{"$f":"IF(INDcold=\"y\",\"Yes\",\"No\")","v":"No"},null,{"$f":"'BREEAM Credits'!EA15","v":"Vehicle delivery and manoeuvring areas"},{"$f":"IF(EDUdelivery=\"y\",\"Yes\",\"No\")","v":"No"},null,null,null,null,{"$f":"'BREEAM Credits'!CO15","v":"Internal goods storage, warehousing and/or vehicle delivery bays/access."},{"$f":"IF(PRIinternalgoods=\"y\",\"Yes\",\"No\")","v":"No"},null,"Development size",{"$f":"IF(RETsmall=\"y\",\"Small Retail <500m2\",+IF(RETlarge=\"y\",\"Medium/Large retail ≥500m2\"))","v":false},null,{"$f":"'BREEAM Credits'!DL15","v":"Vehicle wash"},{"$f":"IF(RETvehiclewash=\"y\",\"Yes\",\"No\")","v":"No"}]
[null,null,"BREEAM Assessor:",null,null,null,{"$f":"'BREEAM Credits'!BK15","v":"Lifts"},{"$f":"IF(HClifts=\"y\",\"Yes\",\"No\")","v":"No"},null,{"$f":"'BREEAM Credits'!BV15","v":"Internal or external soft landscaping/planting"},{"$f":"IF(OFFplanting=\"y\",\"Yes\",\"No\")","v":"Yes"},null,{"$f":"'BREEAM Credits'!ET15","v":"Lifts"},{"$f":"IF(INDlifts=\"y\",\"Yes\",\"No\")","v":"No"},null,{"$f":"'BREEAM Credits'!EB15","v":"Internal or external soft landscaping/planting"},{"$f":"IF(EDUplanting=\"y\",\"Yes\",\"No\")","v":"No"},null,null,null,null,null,null,null,{"$f":"'BREEAM Credits'!DB15","v":"Building Heated"},{"$f":"IF(retheated=\"y\",\"Yes\",\"No\")","v":"No"},null,{"$f":"'BREEAM Credits'!DM15","v":"Waste management facility/area"},{"$f":"IF(RETwastemanagement=\"y\",\"Yes\",\"No\")","v":"No"}]
[null,null,"Licensierad Organisation:",null,null,null,{"$f":"'BREEAM Credits'!BL15","v":"Food preparation, servery and/or dining areas"},{"$f":"IF(HCfoodprep=\"y\",\"Yes\",\"No\")","v":"No"},null,null,null,null,{"$f":"'BREEAM Credits'!EM15","v":"Internal or external soft landscaping/planting"},{"$f":"IF(INDplanting=\"y\",\"Yes\",\"No\")","v":"No"},null,null,null,null,null,null,null,{"$f":"'BREEAM Credits'!CP15","v":"Vehicle delivery and manoeuvring areas"},{"$f":"IF(PRIvehicle=\"y\",\"Yes\",\"No\")","v":"No"},null,{"$f":"'BREEAM Credits'!DE15","v":"Commercial food preparation and/or servery/dining areas"},{"$f":"IF(Retcommercialfoodprep=\"y\",\"Yes\",\"No\")","v":"No"},null,{"$f":"'BREEAM Credits'!DN15","v":"Internal or external soft landscaping/planting"},{"$f":"IF(RETplanting=\"y\",\"Yes\",\"No\")","v":"No"},null,null,null,null,"Projekteringsstadiet"]
[null,null,"Assessment Registrerings No.:",null,null,null,{"$f":"'BREEAM Credits'!BN15","v":"Cold storage plant and enclosures"},{"$f":"IF(HCcoldstorage=\"y\",\"Yes\",\"No\")","v":"No"},null,null,null,null,"Waste management facility/area",{"$f":"IF(INDwasteman=\"y\",\"Yes\",\"No\")","v":"No"},null,null,null,null,null,null,null,{"$f":"'BREEAM Credits'!CQ15","v":"Parking facilities"},{"$f":"IF(PRIparking=\"y\",\"Yes\",\"No\")","v":"No"},null,{"$f":"'BREEAM Credits'!DF15","v":"Cold storage plant and enclosures"},{"$f":"IF(TOYOTA=\"y\",\"N/A\",+IF(RETcold=\"y\",\"Yes\",\"No\"))","v":"No"},null,null,null,null,null,null,null,"Färdig byggnad"]
[null,null,null,null,null,null,{"$f":"'BREEAM Credits'!BM15","v":"Internal or external soft landscaping/planting"},{"$f":"IF(HCPlanting=\"Y\",\"Yes\",\"No\")","v":"No"},null,null,null,null,null,null,null,null,null,null,null,null,null,null,null,null,{"$f":"'BREEAM Credits'!DG15","v":"Lifts"},{"$f":"IF(RETlifts=\"y\",\"Yes\",\"No\")","v":"No"},null,null,null,null,null,null,null,"Ja"]
[null,null,null,null,null,null,null,null,null,null,null,null,null,null,null,null,null,null,null,null,null,null,null,null,{"$f":"'BREEAM Credits'!DH15","v":"Escalators & travelling walkways"},{"$f":"IF(TOYOTA=\"y\",\"N/A\",+IF(RETescalator=\"y\",\"Yes\",\"No\"))","v":"No"},null,null,null,null,null,null,null,"Nej"]
[null,null,null,null,null,null,null,null,null,null,null,null,null,null,null,null,null,null,null,null,null,null,null,null,{"$f":"'BREEAM Credits'!DI15","v":"Internal goods storage, warehousing and/or vehicle delivery bays/access/workshops"},{"$f":"IF(RETinternalgoods=\"y\",\"Yes\",\"No\")","v":"No"},null,null,null,null,null,null,null,"Vet ej"]
[null,null,"Projektets namn:",null,null,null,null,null,null,null,null,null,null,null,null,null,null,null,null,null,null,null,null,null,"Office space",{"$f":"IF(RETofficesmall=\"y\",\"Small office space <500m2\",+IF(RETofficelarge=\"y\",\"Medium/Large office space ≥500m2\",+IF(AND(RETofficelarge=\"\",RETofficesmall=\"\"),\"No\")))","v":"No"}]
[null,null,"Byggnadens plats:",null,null,null,null,null,null,null,null,null,null,null,null,null,null,null,null,null,null,null,null,null,{"$f":"'BREEAM Credits'!DL15","v":"Vehicle wash"},{"$f":"IF(RETvehiclewash=\"y\",\"Yes\",\"No\")","v":"No"}]
[null,null,"Net floor area (m2) - New Build:",null,null,null,null,null,null,null,null,null,null,null,null,null,null,null,null,null,null,null,null,null,{"$f":"'BREEAM Credits'!DM15","v":"Waste management facility/area"},{"$f":"IF(RETwastemanagement=\"y\",\"Yes\",\"No\")","v":"No"}]
[null,null,"Net floor area (m2) - Refurbishment:",null,null,null,null,null,null,null,null,null,null,null,null,null,null,null,null,null,null,null,null,null,{"$f":"'BREEAM Credits'!DN15","v":"Internal or external soft landscaping/planting"},{"$f":"IF(RETplanting=\"y\",\"Yes\",\"No\")","v":"No"}]
[]
[]
[]
[null,null,"Byggherre:"]
[null,null,"Kontaktperson:"]
[null,null,"Adress -  Line 1:"]
[null,null,"Line 2:"]
[null,null,"Line 3:"]
[null,null,"Line 4:"]
[]
[]
[]
[null,null,"Arkitekt:"]
[null,null,"Byggherre:"]
[null,null,"VVS-projektör:"]
[null,null,"El-projektör:"]
[null,null,"Entreprenör:"]
[null,null,"Övrig 1:"]
[null,null,"Övrig 2:"]
[]
[]
[]
[null,null,"Was the assessment required by a statutory / funding body?"]
[null,null,"If yes, what is the name of the body?"]

{"sheet":"BREEAM Pre-Assessment Estimator","index":1,"n_rows":1,"n_cols":1,"rows_kept":1,"cut":false,"hidden":false,"merged":[]}
[1]

{"sheet":"BREEAM Credits","index":2,"n_rows":145,"n_cols":159,"rows_kept":145,"cut":false,"hidden":false,"merged":[[2,25,2,26],[3,25,3,26],[2,23,2,24],[3,23,3,24],[4,23,4,24],[5,23,5,24],[6,23,6,24],[4,25,4,26],[5,25,5,26],[109,16,109,17],[69,16,69,17],[6,25,6,26],[106,16,106,17],[77,16,77,17],[70,16,70,17],[9,23,9,27],[31,16,31,17],[20,16,20,17],[96,16,96,17],[79,16,79,17],[81,16,81,17],[115,16,115,17],[121,16,121,17],[114,16,114,17],[120,16,120,17],[111,16,111,17],[117,16,117,17],[118,16,118,17],[119,16,119,17],[116,16,116,17],[1,19,3,19],[1,20,3,20],[4,19,6,19],[4,20,6,20],[59,16,59,17],[27,16,27,17],[32,16,32,17],[9,20,12,20],[24,16,24,17],[26,16,26,17],[23,16,23,17],[99,16,99,17],[84,16,84,17],[83,16,83,17],[100,16,100,17],[95,16,95,17],[97,16,97,17],[91,16,91,17],[98,16,98,17],[80,16,80,17],[82,16,82,17],[71,2,73,2],[101,16,101,17],[9,4,12,4],[9,5,12,5],[78,16,78,17],[17,16,17,17],[9,11,12,11],[9,12,12,12],[76,16,76,17],[9,6,12,6],[9,7,12,7],[9,8,12,8],[10,16,10,17],[66,16,66,17],[138,16,138,17],[128,16,128,17],[6,154,6,158],[11,154,11,158],[48,16,48,17],[52,16,52,17],[18,16,18,17],[19,16,19,17],[30,16,30,17],[9,19,12,19],[12,16,12,17],[12,154,12,158],[12,23,12,27],[29,16,29,17],[110,16,110,17],[79,29,80,29],[144,16,144,17],[9,9,12,9],[9,10,12,10],[9,14,12,14],[21,16,21,17],[22,16,22,17],[25,16,25,17],[143,16,143,17],[142,16,142,17],[141,16,141,17],[129,16,129,17],[107,16,107,17],[140,16,140,17],[137,16,137,17],[131,16,131,17],[133,16,133,17]]}
[]
[null,null,null,null,null,null,null,null,null,null,null,null,null,null,null,null,null,null,null,"Totalpoäng","Totalpoäng",null,null,"BREEAM-SE Betygsgränser"]
[null,null,null,null,null,null,null,null,null,null,null,null,null,null,null,null,null,null,null,null,null,null,null,"Pass",null,"H",null,"≥30"]
[null,null,null,null,null,null,null,null,null,null,null,null,null,null,null,null,null,null,null,null,null,null,null,"Good",null,"HH",null,"≥45"]
[null,null,null,null,null,null,null,null,null,null,null,null,null,null,null,null,null,null,null,{"$f":"finalscore","v":0},{"$f":"finalscore","v":0},null,null,"Very Good",null,"HHH",null,"≥55"]
[null,null,null,null,null,"Rapportera fel till SGBC genom att klicka på denna text.",null,null,null,null,null,null,null,null,null,null,null,null,null,null,null,null,null,"Excellent",null,"HHHH",null,"≥70"]
[null,"BREEAM Europe Offices 2009 Pre-Assessment Estimator",null,null,null,null,null,null,null,null,null,null,null,null,null,null,null,null,null,null,null,null,null,"Outstanding",null,"HHHHH",null,"≥85",null,null,null,null,"Option 1 - Lease Agreement","Alternativ 1: Hyresavtal mellan fastighetsägare och hyresgäster",null,null,null,null,null,null,null,null,null,null,"Option 1a - Green lease for more than 75% of the net lettable floor area",null,null,null,null,null,null,null,null,null,null,null,null,null,null,null,null,null,null,null,null,null,null,null,null,"Yes"]
[null,null,null,null,null,null,null,null,null,null,null,null,null,null,null,null,null,null,null,null,null,null,null,null,null,null,null,null,null,null,null,null,"Option 2 - Green Building Guide","Alternativ 2: Grön byggnadsguide finns för hyresgästernas inredning",null,null,null,null,null,null,null,null,null,null,"Option 1b - Green lease for less than 75% of the net lettable floor area"]
[null,null,null,null,null,null,null,null,null,null,null,null,null,null,null,null,null,null,null,null,null,null,null,null,null,null,null,null,null,null,null,null,"Option 3 - Actual Specification","Alternativ 3: Samarbete mellan byggherre och hyresgäst",null,null,null,null,null,null,null,null,null,null,"Option 2 - Green Building Guide"]
[null,null,null,null,"Healthcare Criteria","BREEAM-SE Kriterier för handel","BREEAM-SE Kriterier för KONTOR","Courts Criteria","Prisons Criteria","Schools Criteria","Further Education Criteria","BREEAM-SE Kriterier för INDUSTRI","BREEAM Europe: Toyota Retail Units Criteria",null,"Tillgängliga BREEAM-SE poäng",null,"Nybyggnad","Ombyggnad",null,"Totalt viktat betyg","Projektets BREEAM-SE poäng",null,null,"Minimikrav BREEAM-SE",null,null,null,null,null,null,null,null,"Option 4 - No evidence","Alternativ 4: Ingen bevisning",null,null,null,null,null,null,null,null,null,null,"Option 3 - Actual Specification"]
[null,null,null,null,null,null,null,null,null,null,null,null,null,null,null,null,"Area (m2)",null,null,null,null,null,null,"Pass","Good","Very Good","Excellent","Outstanding",null,null,null,null,null,null,null,null,null,null,null,null,null,null,null,null,"Option 4 - No evidence"]
[null,null,null,null,null,null,null,null,null,null,null,null,null,null,null,null,null,null,null,null,null,null,null,{"$f":"'Final Score and Rating'!D18","v":"NO"},{"$f":"'Final Score and Rating'!E18","v":"NO"},{"$f":"'Final Score and Rating'!F18","v":"NO"},{"$f":"'Final Score and Rating'!G18","v":"NO"},{"$f":"'Final Score and Rating'!H18","v":"NO"}]
[null,"No","Indikatornamn",null,null,null,null,null,null,null,null,null,null,null,null,null,"Antal erhållna poäng",null,null,null,null,"Endast oinredd byggnad, val av bevisföring.",null,"Minimikrav för respektive betyg",null,null,null,null,null,"Anteckningar/Kommentarer",null,null,null,"checked",null,"checked",null,null,null,null,null,null,null,null,"Need to check this version",null,null,null,null,null,null,null,"HEALTHCARE CREDIT FILTERING N/A to Europe at present",null,null,null,null,null,null,null,null,null,null,null,null,null,null,null,null,"EUROPE OFFICES CREDIT FILTERING",null,null,null,null,null,null,null,null,null,null,null,"COURTS CREDIT FILTERING N/A to Europe at present",null,null,null,null,null,"PRISONS CREDIT FILTERING - N/A to Europe at present",null,null,null,null,null,null,null,null,null,null,"EUROPE - RETAIL & TOYOTA CREDIT FILTERING",null,null,null,null,null,null,null,null,null,null,null,null,null,null,null,null,null,null,null,null,null,null,"Education credit filtering N/A to Europe at present",null,null,null,null,null,null,null,null,null,null,null,null,null,"Europe Industrial credit filtering",null,null,null,null,null,null,null,null,null,null,null,null,null,null,null,null,null,null,"Minimum BREEAM Standards Offset"]
[]
[null,null,null,null,null,null,null,null,null,null,null,null,null,null,null,null,{"$f":"IF(areanewbuild>0,\"1\",0)","v":0},{"$f":"IF(arearefurb>0,\"1\",0)","v":0},null,{"$f":"Q15+R15","v":0},null,null,null,null,null,null,null,null,null,null,"HC available credits",null,"RET available credits",null,"OFF available credits",null,"COURTS available credits",null,"PRI available credits",null,"Schools available credits",null,"F.E available criteria",null,"IND available credits",null,"Toyota - Retail",null,"Part new build/Part Refurb","Tenancy","Shell & Core",null,"All types","Teaching/specialist hospital","General Acute","Community and mental health","GP Surgeries","Health centres and clinics","Inpatients","Outpatients","Small ","Medium/Large","Lifts","Food preparation, servery and/or dining areas","Internal or external soft landscaping/planting","Cold storage plant and enclosures","Filter column","Filter column",null,"All types","New builds/ refurbs","Fit Out only","Building Heated","Internal or external soft landscaping/planting","Food preparation area","Servery/dining area","Lifts","Escalators","Filter column","Filter column",null,"All types","Internal or external soft landscaping/planting","Lifts","Filter column","Filter column",null,"All types","Food preparation and/or dining areas","Cold storage plant and enclosures","Swimming pool","Lifts","Internal goods storage, warehousing and/or vehicle delivery bays/access.","Vehicle delivery and manoeuvring areas","Parking facilities","Filter column","Filter column",null,"All types","New builds/ refurbs","Fit Out only","General display and sale of goods retail","Food retail","Food preparation and service retail","Service provider","Building Heated","Small retail building (<500m2)","Large retail building (≥500m2)","Commercial food preparation and/or servery/dining areas","Cold storage plant and enclosures","Lifts","Escalators & travelling walkways","Internal goods storage, warehousing and/or vehicle delivery bays/access/workshops","Office space <500m2","Office space ≥500m2","Vehicle wash","Waste management facility/area","Internal or external soft landscaping/planting","Filter column","Filter column",null,"All types","School","F.E","Primary school","Secondary school","Lifts","Fume cupboardscabinets","Swimming pool","Cold Storage plant and enclosures","Vehicle delivery and manoeuvring areas","Internal or external soft landscaping/planting","Filter column","Filter column",null,"All types","New builds/ refurbs","Fit Out only","Small Industrail building (<500m2)","Large/medium industrial building (≥500m2)","Office space <500m2","Office space ≥500m2","Internal or external soft landscaping/planting","Commercial food preparation and/or servery/dining areas","Building Heated","Heated Operational Area","Vehicle delivery bays/access to warehouse","Cold storage plant and enclosures","Waste management facility/area","Lifts","Filter column","Filter column"]
[null,null,null,null,null,null,null,null,null,null,null,null,null,null,null,null,{"$f":"areanewbuild/totalarea","v":{"$error":"#DIV/0!"}},{"$f":"arearefurb/totalarea","v":{"$error":"#DIV/0!"}},null,{"$f":"IF(T15=2,(SUM(Q12:R12)),0)","v":0},null,null,null,null,null,null,null,null,null,null,null,null,null,null,"Y",null,null,null,null,null,null,null,null,null,null,null,null,null,null,null,null,null,null,null,null,null,null,null,null,null,null,null,null,null,null,null,null,null,null,null,null,"Y","y","y","y",null,"y","y"]
[null,"Ledning"]
[null,"Man 1","Idrifttagning av byggnaden","One credit where evidence provided demonstrates that sufficient time and resources will be allocated for commissioning prior to handover in the construction programme to ensure efficient operation of all the services within the building.     \n                                                                                                                                                                                                                                                                                       Two credits where, in addition to the above, evidence provided demonstrates that commissioning will be carried out in line with best practice commissioning codes and that seasonal commissioning will be carried out during the first year of occupation, post construction (or post fit out).",null,"Första poängen 1. En eller flera lämpliga personer i projektgruppen utses som samordnare för idrifttagning. Dessa ska övervaka planering och förberedelse för idrifttagning, inklusive eventuella efterjusteringar av föl-jande system, om relevant: \n• Värmesystem\n• Tappvattensystem\n• Belysningssystem\n• Ventilationssystem\n• Kylsystem\n• Styr- och reglersystem (även manuella)\n• Kylförvaring \n2. Huvudentreprenören ska utarbeta ett program med tydligt angivna ansvarsområden för idrifttag-ning, kriterier och tidsplan. Särskilt viktigt är att tillräckligt med tid avsätts för idrifttagning.\n3. För komplexa system utses en samordnare med specialistkompetens redan under projekterings-skedet för idrifttagning (antingen av byggherre eller av entreprenör). I ansvarsområdet ingår att uti-från sin specialistkompetens:\n• Bidra till utformning av system under projekteringen genom att revisioner med avseende på rationell drift. \n• Ge input utifrån sin kompentens vid planering av byggskedet\n• Ge löpande information under byggskedet\n• Leda och organisera idrifttagning, genomföra provningar och delta under överlåtelsen.\n\nAndra poängen\n1. Första poängen har uppnåtts.\n2. Idrifttagningen sker i linje med nationella riktlinjer för bästa praxis, se nedan.\n3. Om ett styr- och övervakningssystem finns, ska följande uppfyllas: \na. Idrifttagning av ventilations- och vattenburna system sker när alla styr- och övervakningsfunkt-ioner är installerade och fungerande.\nb. Idrifttagningen ska omfatta mätning av vatten- och luftflöden, rumstemperaturer, tilluftstemperaturer och andra nyckelparametrar.\nc. All automatik i anslutning till  styr- och övervakningssystem ska fungera före överlämnandet.\nd. Alla styrscheman och grafik med användargränssnitt som är relevanta för styr- och övervak-ningssystemen ska ha installerats och fungera före överlämnandet. \ne. Driftpersonalen kommer att utbildas fullt ut i systemen.\n4. Ovanstående ska inkludera ansvar för säsongsmässig idrifttagning under minst 12 månader efter att byggnaden tagits i bruk.\n\nFör mer information om Komplexa- och Enklasystem, se manualen.\n\n","Första poängen 1. En eller flera lämpliga i projektgruppen utses som samordnare för idrifttagning. Dessa ska övervaka planering och förberedelse för idrifttagning, inklusive eventuella efterjusteringar av föl-jande system, om relevant: \n• Värmesystem\n• Tappvattensystem\n• Belysningssystem\n• Ventilationssystem\n• Kylsystem\n• Styr- och reglersystem (även manuella)\n• Kylförvaring \n2. Huvudentreprenören ska utarbeta ett program med tydligt angivna ansvarsområden för idrifttag-ning, kriterier och tidsplan. Särskilt viktigt är att tillräckligt med tid avsätts för idrifttagning.\n3. För komplexa system utses en samordnare med specialistkompetens redan under projekterings-skedet för idrifttagning (antingen av byggherre eller av entreprenör). I ansvarsområdet ingår att uti-från sin specialistkompetens:\n• Bidra till utformning av system under projekteringen genom att revisioner med avseende på rationell drift. \n• Ge input utifrån sin kompentens vid planering av byggskedet\n• Ge löpande information under byggskedet\n• Leda och organisera idrifttagning, genomföra provningar och delta under överlåtelsen.\n\nAndra poängen\n1. Första poängen har uppnåtts.\n2. Idrifttagningen sker i linje med nationella riktlinjer för bästa praxis, se nedan.\n3. Om ett styr- och övervakningssystem finns, ska följande uppfyllas: \na. Idrifttagning av ventilations- och vattenburna system sker när alla styr- och övervakningsfunkt-ioner är installerade och fungerande.\nb. Idrifttagningen ska omfatta mätning av vatten- och luftflöden, rumstemperaturer, tilluftstemperaturer och andra nyckelparametrar.\nc. All automatik i anslutning till  styr- och övervakningssystem ska fungera före överlämnandet.\nd. Alla styrscheman och grafik med användargränssnitt som är relevanta för styr- och övervak-ningssystemen ska ha installerats och fungera före överlämnandet. \ne. Driftpersonalen kommer att utbildas fullt ut i systemen.\n4. Ovanstående ska inkludera ansvar för säsongsmässig idrifttagning under minst 12 månader efter att byggnaden tagits i bruk:\n\nKomplexa system – Samordnare med specialistkompetens \na. Funktionsprovning av alla installationssystem sker vid full belastning och vid dellast (vår/höst). Med full belastning avses till exempel att värmesystem provas mitt i vintern och komfort-kyla/ventilation mitt i sommaren. \nb. Där det är relevant ska funktionsprovning ske under perioder då extremt många eller få brukare vistas i byggnaden.\nc. Intervjuer med byggnadens brukare (som berörs av komplexa system) för att identifiera pro-blem eller frågor som rör systemets funktion.\nd. Återstart av systemen (efter åtgärder och justeringar för anpassning efter behov) och alla rele-vanta ändringar införs i drift- och skötselinstruktionerna.\n\nDär det finns särskilda installationssystem som dragskåp, mikrobiologiska säkerhetsskåp och för kyllager, ska assessorn säkerställa att dessa ingår i ansvarsområdet för samordnaren med specialistkompetens.\n\nEnkla system (naturligt ventilerade) – extern rådgivare eller driftsledning\na. Kontroll av termisk komfort, ventilation och belysning sker tre, sex, nio och tolv månader efter att byggnaden tagits i bruk. Kontroll innebär antingen mätning eller återkoppling från brukarna. \nb. Vidta alla relevanta idrifttagningssteg vid omstart och kontroller av systemen. Relevanta ändringar inarbetas i drift- och skötselinstruktionerna.\n",{"$f":"$D18","v":"One credit where evidence provided demonstrates that sufficient time and resources will be allocated for commissioning prior to handover in the construction programme to ensure efficient operation of all the services within the building.     \n                                                                                                                                                                                                                                                                                       Two credits where, in addition to the above, evidence provided demonstrates that commissioning will be carried out in line with best practice commissioning codes and that seasonal commissioning will be carried out during the first year of occupation, post construction (or post fit out)."},null,null,null,"Första poängen 1. En eller flera lämpliga personer i projektgruppen utses som samordnare för idrifttagning. Dessa ska övervaka planering och förberedelse för idrifttagning, inklusive eventuella efterjusteringar av föl-jande system, om relevant: \n• Värmesystem\n• Tappvattensystem\n• Belysningssystem\n• Ventilationssystem\n• Kylsystem\n• Styr- och reglersystem (även manuella)\n• Kylförvaring \n2. Huvudentreprenören ska utarbeta ett program med tydligt angivna ansvarsområden för idrifttagning, kriterier och tidsplan. Särskilt viktigt är att tillräckligt med tid avsätts för idrifttagning.\n3. För komplexa system utses en samordnare med specialistkompetens redan under projekterings-skedet för idrifttagning (antingen av byggherre eller av entreprenör). I ansvarsområdet ingår att utifrån sin specialistkompetens:\n• Bidra till utformning av system under projekteringen genom att revisioner med avseende på rationell drift. \n• Ge input utifrån sin kompentens vid planering av byggskedet\n• Ge löpande information under byggskedet\n• Leda och organisera idrifttagning, genomföra provningar och delta under överlåtelsen.\n\nAndra poängen\n1. Första poängen har uppnåtts.\n2. Idrifttagningen sker i linje med nationella riktlinjer för bästa praxis, se nedan.\n3. Om ett styr- och övervakningssystem finns, ska följande uppfyllas: \na. Idrifttagning av ventilations- och vattenburna system sker när alla styr- och övervakningsfunkt-ioner är installerade och fungerande.\nb. Idrifttagningen ska omfatta mätning av vatten- och luftflöden, rumstemperaturer, tilluftstemperaturer och andra nyckelparametrar.\nc. All automatik i anslutning till  styr- och övervakningssystem ska fungera före överlämnandet.\nd. Alla styrscheman och grafik med användargränssnitt som är relevanta för styr- och övervak-ningssystemen ska ha installerats och fungera före överlämnandet. \ne. Driftpersonalen kommer att utbildas fullt ut i systemen.\n4. Ovanstående ska inkludera ansvar för säsongsmässig idrifttagning under minst 12 månader efter att byggnaden tagits i bruk:\n\nKomplexa system – Samordnare med specialistkompetens \na. Funktionsprovning av alla installationssystem sker vid full belastning och vid dellast (vår/höst). Med full belastning avses till exempel att värmesystem provas mitt i vintern och komfor-kyla/ventilation mitt i sommaren. \nb. Där det är relevant ska funktionsprovning ske under perioder då extremt många eller få brukare vistas i byggnaden.\nc. Intervjuer med byggnadens brukare (som berörs av komplexa system) för att identifiera problem eller frågor som rör systemets funktion.\nd. Återstart av systemen (efter åtgärder och justeringar för anpassning efter behov) och alla relevanta ändringar införs i drift- och skötselinstruktionerna.\n\nDär det finns särskilda installationssystem som dragskåp, mikrobiologiska säkerhetsskåp och för kyllager, ska assessorn säkerställa att dessa ingår i ansvarsområdet för samordnaren med specialistkompetens.\n\nEnkla system (naturligt ventilerade) – extern rådgivare eller driftsledning\na. Kontroll av termisk komfort, ventilation och belysning sker tre, sex, nio och tolv månader efter att byggnaden tagits i bruk. Kontroll innebär antingen mätning eller återkoppling från brukarna. \nb. Vidta alla relevanta idrifttagningssteg vid omstart och kontroller av systemen. Relevanta änd-ringar inarbetas i drift- och skötselinstruktionerna.\n",{"$f":"$D18","v":"One credit where evidence provided demonstrates that sufficient time and resources will be allocated for commissioning prior to handover in the construction programme to ensure efficient operation of all the services within the building.     \n                                                                                                                                                                                                                                                                                       Two credits where, in addition to the above, evidence provided demonstrates that commissioning will be carried out in line with best practice commissioning codes and that seasonal commissioning will be carried out during the first year of occupation, post construction (or post fit out)."},null,{"$f":"IF(HC=\"y\",AE18,+IF(Ret=\"y\",AG18,+IF(OFF=\"y\",AI18,+IF(TOYOTA=\"y\",AU18,+IF(PRISONS=\"y\",AM18,+IF(SCHOOLS=\"y\",AO18,+IF(FE=\"y\",AQ18,+IF(INDUSTRIAL=\"y\",AS18))))))))","v":2},null,null,null,null,{"$f":"IF(partnewpartrefurb=\"y\",Q18,0)","v":0},null,"Option 1 - Lease Agreement",null,{"$f":"IF(OR(islike($V18,\"*2*\"),islike($V18,\"*1B*\")),EY18*0.5,EY18)","v":{"$error":"#NAME?"}},{"$f":"IF(OR(islike($V18,\"*2*\"),islike($V18,\"*1B*\")),EZ18*0.5,EZ18)","v":{"$error":"#NAME?"}},{"$f":"IF(OR(islike($V18,\"*2*\"),islike($V18,\"*1B*\")),FA18*0.5,FA18)","v":{"$error":"#NAME?"}},{"$f":"IF(OR(islike($V18,\"*2*\"),islike($V18,\"*1B*\")),FB18*0.5,FB18)","v":{"$error":"#NAME?"}},{"$f":"IF(OR(islike($V18,\"*2*\"),islike($V18,\"*1B*\")),FC18*0.5,FC18)","v":{"$error":"#NAME?"}},null,null,null,null,{"$f":"IF(DP18=\"y\",AH18,0)","v":2},2,{"$f":"IF(CB18=\"y\",AJ18,0)","v":2},2,null,null,null,null,null,null,null,null,{"$f":"IF(EV18=\"y\",AT18,0)","v":2},2,{"$f":"IF(DP18=\"y\",AV18,0)","v":2},2,2,null,null,null,1,null,null,null,null,null,null,null,null,null,null,null,null,null,{"$f":"SUM(BA18:BN18)","v":1},{"$f":"IF(BO18>=0.1,\"Y\",\"N\")","v":"Y"},null,2,null,null,null,null,null,null,null,null,{"$f":"SUM(BR18:BZ18)","v":2},{"$f":"IF(CA18>=0.1,\"Y\",\"N\")","v":"Y"},null,1,null,null,{"$f":"SUM(CD18:CF18)","v":1},{"$f":"IF(CG18>=0.1,\"Y\",\"N\")","v":"Y"},null,1,null,null,null,null,null,null,null,{"$f":"SUM(CJ18:CQ18)","v":1},{"$f":"IF(CR18>=0.1,\"Y\",\"N\")","v":"Y"},null,2,null,null,null,null,null,null,null,null,null,null,null,null,null,null,null,null,null,null,null,{"$f":"SUM(CU18:DN18)","v":2},{"$f":"IF(DO18>=0.1,\"Y\",\"N\")","v":"Y"},null,1,null,null,null,null,null,null,null,null,null,null,{"$f":"SUM(DR18:EB18)","v":1},{"$f":"IF(EC18>=0.1,\"Y\",\"N\")","v":"Y"},null,2,null,null,null,null,null,null,null,null,null,null,null,null,null,null,{"$f":"SUM(EF18:ET18)","v":2},{"$f":"IF(EU18>=0.1,\"Y\",\"N\")","v":"Y"},null,null,0,0,0,1,2]
[null,"Man 2","Entreprenörens riktlinjer för miljö och socialt ansvar ","One credit where evidence provided demonstrates that there is a commitment to comply with best practice site management principles.\n\nTwo credits where evidence provided demonstrates that there is a commitment to go beyond best practice site management principles.",null,"Första poängen\nHuvudentreprenören: \n1. Sex av punkterna i varje kategori i checklista A2 följs.\n2. Har en arbetsmiljöplan som uppfyller kraven i svensk arbetsmiljölagstiftning\n3. Genomför regelbundna skydds- och miljöronder, till exempel Arbetsplatsrond, SBUF \n\nAndra poängen\n4. Första poängen har uppnåtts\n5. Huvudentreprenören följer alla kriterier i alla delar i checklista A2.\n                                                                         ","Första poängen\nHuvudentreprenören: \n1. Sex av punkterna i varje kategori i checklista A2 följs.\n2. Har en arbetsmiljöplan som uppfyller kraven i svensk arbetsmiljölagstiftning\n3. Genomför regelbundna skydds- och miljöronder, till exempel Arbetsplatsrond, SBUF \n\nAndra poängen\n4. Första poängen har uppnåtts\n5. Huvudentreprenören följer alla kriterier i alla delar i checklista A2.\n                                                                         ",{"$f":"$D19","v":"One credit where evidence provided demonstrates that there is a commitment to comply with best practice site management principles.\n\nTwo credits where evidence provided demonstrates that there is a commitment to go beyond best practice site management principles."},null,null,null,"Första poängen\nHuvudentreprenören: \n1. Sex av punkterna i varje kategori i checklista A2 följs.\n2. Har en arbetsmiljöplan som uppfyller kraven i svensk arbetsmiljölagstiftning\n3. Genomför regelbundna skydds- och miljöronder, till exempel Arbetsplatsrond, SBUF \n\nAndra poängen\n4. Första poängen har uppnåtts\n5. Huvudentreprenören följer alla kriterier i alla delar i checklista A2.                                                                         ",{"$f":"$D19","v":"One credit where evidence provided demonstrates that there is a commitment to comply with best practice site management principles.\n\nTwo credits where evidence provided demonstrates that there is a commitment to go beyond best practice site management principles."},null,2,null,null,null,null,{"$f":"IF(partnewpartrefurb=\"y\",Q19,0)","v":0},null,null,null,{"$f":"IF(OR(islike($V19,\"*2*\"),islike($V19,\"*1B*\")),EY19*0.5,EY19)","v":{"$error":"#NAME?"}},{"$f":"IF(OR(islike($V19,\"*2*\"),islike($V19,\"*1B*\")),EZ19*0.5,EZ19)","v":{"$error":"#NAME?"}},{"$f":"IF(OR(islike($V19,\"*2*\"),islike($V19,\"*1B*\")),FA19*0.5,FA19)","v":{"$error":"#NAME?"}},{"$f":"IF(OR(islike($V19,\"*2*\"),islike($V19,\"*1B*\")),FB19*0.5,FB19)","v":{"$error":"#NAME?"}},{"$f":"IF(OR(islike($V19,\"*2*\"),islike($V19,\"*1B*\")),FC19*0.5,FC19)","v":{"$error":"#NAME?"}},null,null,null,null,{"$f":"IF(DP19=\"y\",AH19,0)","v":2},2,2,2,null,null,null,null,null,null,null,null,2,2,2,2,2,null,null,null,1,null,null,null,null,null,null,null,null,null,null,null,null,null,1,"Y",null,2,null,null,null,null,null,null,null,null,2,"Y",null,1,null,null,1,"Y",null,1,null,null,null,null,null,null,null,1,"Y",null,2,null,null,null,null,null,null,null,null,null,null,null,null,null,null,null,null,null,null,null,2,"Y",null,1,null,null,null,null,null,null,null,null,null,null,1,{"$f":"IF(EC19>=0.1,\"Y\",\"N\")","v":"Y"},null,2,null,null,null,null,null,null,null,null,null,null,null,null,null,null,2,"Y",null,null,0,0,0,0,0]
[null,"Man 3","Byggarbetsplatsens påverkan","One credit where evidence provided demonstrates that 2 or more of items a-g (listed below) are achieved.\n\nTwo credits where evidence provided demonstrates that 4 or more of items a-g (listed below) are achieved.\n\nThree credits where evidence provided demonstrates that 6 or more of items a-g are achieved:\na. Monitor, report and set targets for CO2 or energy arising from site activities\nb. Monitor, report and set targets for CO2 or energy arising from transport to and from site\nc. Monitor, report and set targets for water consumption arising from site activities\nd. Implement best practice policies in respect of air (dust) pollution arising from the site\ne. Implement best practice policies in respect of water (ground and surface) pollution occurring on the site\nf. Main contractor has an environmental materials policy, used for sourcing of construction materials to be utilised on site\ng. Main contractor operates an Environmental Management System.\n\nOne additional credit where evidence provided demonstrates that at least 80% of site timber is responsibly sourced and 100% is legally sourced.",null,"Nybyggnad och renovering\n\n1. Ett poäng om det dokumenteras att 2 eller fler av punkterna a-g (i listan nedan) uppnåtts. \n\nELLER\nTvå poäng om det dokumenteras att 4 eller fler av punkterna a-g (i listan nedan) uppnåtts. \n\nELLER\nTre poäng om det dokumenteras att 6 eller fler av punkterna a-g (i listan nedan) uppnåtts.\n\na. Sätta mål, övervaka och rapportera energianvändning eller CO2-utsläpp från aktiviteter på byggarbetsplatsen.\nb. Övervaka och rapportera energianvändning eller CO2-utsläpp från transporter till och från byggarbetsplatsen.\nc. Sätta mål, övervaka och rapportera vattenanvändning från aktiviteter på byggplatsen.\nd. Implementera riktlinjer för bästa praxis vad gäller damm från byggplatsen.\ne. Implementera riktlinjer för bästa praxis vad gäller vattenföroreningar (mark och yta) från bygg-arbetsplatsen.\nf. Huvudentreprenören har en miljöpolicy för byggnadsmaterial, policyn följs vid inköp av bygg-material som ska användas på platsen.\ng. Huvudentreprenören arbetar enligt ett miljöstyrningssystem (EMS).\n\nBedömningskriterier för punkterna a-g beskrivs i detalj i checklista A3.\n\n2. Ett poäng om det kan styrkas att minst 80 % av trävirke till byggarbetsplatsen är ansvarsfullt inköpt och 100 % är lagligt avverkat. \n\n\n","Nybyggnad och renovering\n\n1. Ett poäng om det dokumenteras att 2 eller fler av punkterna a-g (i listan nedan) uppnåtts. \n\nELLER\nTvå poäng om det dokumenteras att 4 eller fler av punkterna a-g (i listan nedan) uppnåtts. \n\nELLER\nTre poäng om det dokumenteras att 6 eller fler av punkterna a-g (i listan nedan) uppnåtts.\n\na. Sätta mål, övervaka och rapportera energianvändning eller CO2-utsläpp från aktiviteter på byggarbetsplatsen.\nb. Övervaka och rapportera energianvändning eller CO2-utsläpp från transporter till och från byggarbetsplatsen.\nc. Sätta mål, övervaka och rapportera vattenanvändning från aktiviteter på byggplatsen.\nd. Implementera riktlinjer för bästa praxis vad gäller damm från byggplatsen.\ne. Implementera riktlinjer för bästa praxis vad gäller vattenföroreningar (mark och yta) från bygg-arbetsplatsen.\nf. Huvudentreprenören har en miljöpolicy för byggnadsmaterial, policyn följs vid inköp av bygg-material som ska användas på platsen.\ng. Huvudentreprenören arbetar enligt ett miljöstyrningssystem (EMS).\n\nBedömningskriterier för punkterna a-g beskrivs i detalj i checklista A3.\n\n2. Ett poäng om det kan styrkas att minst 80 % av trävirke till byggarbetsplatsen är ansvarsfullt inköpt och 100 % är lagligt avverkat. \n\n\n",{"$f":"$E20","v":0},null,null,null,"Nybyggnad och renovering\n1. Ett poäng om det dokumenteras att 2 eller fler av punkterna a-g (i listan nedan) uppnåtts. \nELLER\nTvå poäng om det dokumenteras att 4 eller fler av punkterna a-g (i listan nedan) uppnåtts. \nELLER\nTre poäng om det dokumenteras att 6 eller fler av punkterna a-g (i listan nedan) uppnåtts.\na. Sätta mål, övervaka och rapportera energianvändning eller CO2-utsläpp från aktiviteter på byggarbetsplatsen.\nb. Övervaka och rapportera energianvändning eller CO2-utsläpp från transporter till och från byggarbetsplatsen.\nc. Sätta mål, övervaka och rapportera vattenanvändning från aktiviteter på byggplatsen.\nd. Implementera riktlinjer för bästa praxis vad gäller damm från byggplatsen.\ne. Implementera riktlinjer för bästa praxis vad gäller vattenföroreningar (mark och yta) från byggarbetsplatsen.\nf. Huvudentreprenören har en miljöpolicy för byggnadsmaterial, policyn följs vid inköp av bygg-material som ska användas på platsen.\ng. Huvudentreprenören arbetar enligt ett miljöstyrningssystem (EMS).\n\nBedömningskriterier för punkterna a-g beskrivs i detalj i checklista A3.\n\n2. Ett poäng om det kan styrkas att minst 80 % av trävirke till byggarbetsplatsen är ansvarsfullt inköpt och 100 % är lagligt avverkat. \n\n\n",{"$f":"$D20","v":"One credit where evidence provided demonstrates that 2 or more of items a-g (listed below) are achieved.\n\nTwo credits where evidence provided demonstrates that 4 or more of items a-g (listed below) are achieved.\n\nThree credits where evidence provided demonstrates that 6 or more of items a-g are achieved:\na. Monitor, report and set targets for CO2 or energy arising from site activities\nb. Monitor, report and set targets for CO2 or energy arising from transport to and from site\nc. Monitor, report and set targets for water consumption arising from site activities\nd. Implement best practice policies in respect of air (dust) pollution arising from the site\ne. Implement best practice policies in respect of water (ground and surface) pollution occurring on the site\nf. Main contractor has an environmental materials policy, used for sourcing of construction materials to be utilised on site\ng. Main contractor operates an Environmental Management System.\n\nOne additional credit where evidence provided demonstrates that at least 80% of site timber is responsibly sourced and 100% is legally sourced."},null,0,null,null,null,null,0,null,null,null,{"$f":"IF(OR(islike($V20,\"*2*\"),islike($V20,\"*1B*\")),EY20*0.5,EY20)","v":{"$error":"#NAME?"}},{"$f":"IF(OR(islike($V20,\"*2*\"),islike($V20,\"*1B*\")),EZ20*0.5,EZ20)","v":{"$error":"#NAME?"}},{"$f":"IF(OR(islike($V20,\"*2*\"),islike($V20,\"*1B*\")),FA20*0.5,FA20)","v":{"$error":"#NAME?"}},{"$f":"IF(OR(islike($V20,\"*2*\"),islike($V20,\"*1B*\")),FB20*0.5,FB20)","v":{"$error":"#NAME?"}},{"$f":"IF(OR(islike($V20,\"*2*\"),islike($V20,\"*1B*\")),FC20*0.5,FC20)","v":{"$error":"#NAME?"}},null,null,null,null,0,4,0,4,null,null,null,null,null,null,null,null,0,4,0,4,null,null,null,null,1,null,null,null,null,null,null,null,null,null,null,null,null,null,1,"Y",null,null,{"$f":"IF(Offnewrefurb=\"y\",1,0)","v":0},null,null,null,null,null,null,null,0,"N",null,1,null,null,1,{"$f":"IF(CG20>=0.1,\"Y\",\"N\")","v":"Y"},null,1,null,null,null,null,null,null,null,1,{"$f":"IF(CR20>=0.1,\"Y\",\"N\")","v":"Y"},null,null,{"$f":"IF(RETnewrefurb=\"y\",1,0)","v":0},null,null,null,null,null,null,null,null,null,null,null,null,null,null,null,null,null,null,0,{"$f":"IF(DO20>=0.1,\"Y\",\"N\")","v":"N"},null,1,null,null,null,null,null,null,null,null,null,null,1,{"$f":"IF(EC20>=0.1,\"Y\",\"N\")","v":"Y"},null,null,{"$f":"IF(INDnewrefurb=\"Y\",1,0)","v":0},null,null,null,null,null,null,null,null,null,null,null,null,null,0,{"$f":"IF(EU20>=0.1,\"Y\",\"N\")","v":"N"},null,null,0,0,0,1,2]
[null,"Man 3","Byggarbetsplatsens påverkan - Enbart inredning","One credit where evidence provided demonstrates that the fit-out contractor adopts best practice policies in respect of air (dust) pollution arising from the site.\n\nOne credit where evidence provided demonstrates that the fit-out contractor has an environmental materials policy, used for sourcing of construction materials to be utilised on site.\n\nOne credit where evidence provided demonstrates that the fit-out contractor operates an Environmental Management System.",null,"Bedömningar av enbart inredning\n1. Ett poäng om dokumentationen visar att inredningsentreprenören använder riktlinjer för bästa praxis när det gäller luftföroreningar i form av damm från byggplatsen.\n2. Ett poäng om dokumentationen visar att inredningsentreprenören har riktlinjer för miljövänliga material, som används vid inköp av byggmaterial som ska användas på platsen.\n3. Ett poäng om dokumentationen visar att inredningsentreprenören använder ett miljöledningssystem (EMS).\n\nBedömningskriterierna för varje område här ovan finns i det relevanta avsnittet i checklista A3.\n\nKriterier för exemplarisk nivå – gäller endast vid nybyggnad och renovering\nFöljande kriterier ska uppfyllas för att en innovationspoäng i denna BREEAM-indikator.\n\n4. Ett poäng om minst 100 % av trävirket till byggarbetsplatsen är inköpt på ett ansvarsfullt sätt och 100 % är lagligt avverkat.","Bedömningar av enbart inredning\n1. Ett poäng om dokumentationen visar att inredningsentreprenören använder riktlinjer för bästa praxis när det gäller luftföroreningar i form av damm från byggplatsen.\n2. Ett poäng om dokumentationen visar att inredningsentreprenören har riktlinjer för miljövänliga material, som används vid inköp av byggmaterial som ska användas på platsen.\n3. Ett poäng om dokumentationen visar att inredningsentreprenören använder ett miljöledningssystem (EMS).\n\nBedömningskriterierna för varje område här ovan finns i det relevanta avsnittet i checklista A3.\n\nKriterier för exemplarisk nivå – gäller endast vid nybyggnad och renovering\nFöljande kriterier ska uppfyllas för att en innovationspoäng i denna BREEAM-indikator.\n\n4. Ett poäng om minst 100 % av trävirket till byggarbetsplatsen är inköpt på ett ansvarsfullt sätt och 100 % är lagligt avverkat.","N/A",null,null,null,"Bedömningar av enbart inredning\n1. Ett poäng om dokumentationen visar att inredningsentreprenören använder riktlinjer för bästa praxis när det gäller luftföroreningar i form av damm från byggplatsen.\n2. Ett poäng om dokumentationen visar att inredningsentreprenören har riktlinjer för miljövänliga material, som används vid inköp av byggmaterial som ska användas på platsen.\n3. Ett poäng om dokumentationen visar att inredningsentreprenören använder ett miljöledningssystem (EMS).\n\nBedömningskriterierna för varje område här ovan finns i det relevanta avsnittet i checklista A3.\n\nKriterier för exemplarisk nivå – gäller endast vid nybyggnad och renovering\nFöljande kriterier ska uppfyllas för att en innovationspoäng i denna BREEAM-indikator.\n\n4. Ett poäng om minst 100 % av trävirket till byggarbetsplatsen är inköpt på ett ansvarsfullt sätt och 100 % är lagligt avverkat.",{"$f":"$D21","v":"One credit where evidence provided demonstrates that the fit-out contractor adopts best practice policies in respect of air (dust) pollution arising from the site.\n\nOne credit where evidence provided demonstrates that the fit-out contractor has an environmental materials policy, used for sourcing of construction materials to be utilised on site.\n\nOne credit where evidence provided demonstrates that the fit-out contractor operates an Environmental Management System."},null,{"$f":"IF(HC=\"y\",AE21,+IF(Ret=\"y\",AG21,+IF(OFF=\"y\",AI21,+IF(TOYOTA=\"y\",AU21,+IF(PRISONS=\"y\",AM21,+IF(SCHOOLS=\"y\",AO21,+IF(FE=\"y\",AQ21,+IF(INDUSTRIAL=\"y\",AS21))))))))","v":3},null,null,null,null,0,null,null,null,{"$f":"IF(OR(islike($V21,\"*2*\"),islike($V21,\"*1B*\")),EY21*0.5,EY21)","v":{"$error":"#NAME?"}},{"$f":"IF(OR(islike($V21,\"*2*\"),islike($V21,\"*1B*\")),EZ21*0.5,EZ21)","v":{"$error":"#NAME?"}},{"$f":"IF(OR(islike($V21,\"*2*\"),islike($V21,\"*1B*\")),FA21*0.5,FA21)","v":{"$error":"#NAME?"}},{"$f":"IF(OR(islike($V21,\"*2*\"),islike($V21,\"*1B*\")),FB21*0.5,FB21)","v":{"$error":"#NAME?"}},{"$f":"IF(OR(islike($V21,\"*2*\"),islike($V21,\"*1B*\")),FC21*0.5,FC21)","v":{"$error":"#NAME?"}},null,null,null,null,{"$f":"IF(DP21=\"y\",AH21,0)","v":0},3,3,3,null,null,null,null,null,null,null,null,4,4,0,4,4,null,null,null,null,null,null,null,null,null,null,null,null,null,null,null,null,null,{"$f":"SUM(BA21:BN21)","v":0},"N",null,null,null,{"$f":"IF(OFFfitout=\"y\",1,0)","v":1},null,null,null,null,null,null,1,"Y",null,0,null,null,0,"N",null,0,null,null,null,null,null,null,null,0,"N",null,null,null,{"$f":"IF(RETfitout=\"y\",1,0)","v":0},null,null,null,null,null,null,null,null,null,null,null,null,null,null,null,null,null,0,"N",null,0,null,null,null,null,null,null,null,null,null,null,0,"N",null,null,4,{"$f":"IF(INDfitout=\"y\",3,0)","v":0},null,null,null,null,null,null,null,null,null,null,null,null,4,"Y",null,null,0,0,0,1,2]
[null,"Man 4","Brukarvägledning","One credit where evidence provided demonstrates the provision of a simple guide that covers information relevant to the tenant/occupants and non-technical building manager on the operation and environmental performance of the building.",null,"Första poängen\n1. En brukarvägledning för byggnaden har utarbetats med information som beskrivs under \"Innehåll i brukarvägledning\" (se Ytterligare information).\n2. Brukarvägledningen är anpassad för icke-teknikkunniga brukare i byggnaden och för andra berörda. \n\nAndra poängen\n3. Byggvarudeklarationer införskaffas och samlas i en loggbok som biläggs drift- och skötselinstruktionerna. Den ska innehålla minst 70 % av produkterna i listan med prioriterade byggdelar definierade i Mat 8, tabell A. \n4. Beskrivning av respektive byggvaras mängd och placering (dokumenterade i Tabell A).\n","Första poängen\n1. En brukarvägledning för byggnaden har utarbetats, som innehåller den information som beskrivs under Innehåll i brukarvägledning (se Ytterligare information).\n2. Brukarvägledningen är anpassad för icke-teknikkunniga brukare i byggnaden och för andra berörda. \n\nAndra poängen\n3. Byggvarudeklarationer införskaffas och samlas i en loggbok som biläggs drift- och skötselinstrukt-ionerna. Den ska innehålla minst 70 % av produkterna i listan med prioriterade byggdelar definie-rade i Mat 8, tabell A. \n4. Beskrivning av respektive byggvaras mängd och placering (dokumenterade i Tabell A).\n",{"$f":"$D22","v":"One credit where evidence provided demonstrates the provision of a simple guide that covers information relevant to the tenant/occupants and non-technical building manager on the operation and environmental performance of the building."},null,null,null,"Första poängen\n1. En brukarvägledning för byggnaden har utarbetats, som innehåller den information som beskrivs under Innehåll i brukarvägledning (se Ytterligare information).\n2. Brukarvägledningen är anpassad för icke-teknikkunniga brukare i byggnaden och för andra berörda. \n\nAndra poängen\n3. Byggvarudeklarationer införskaffas och samlas i en loggbok som biläggs drift- och skötselinstruktionerna. Den ska innehålla minst 70 % av produkterna i listan med prioriterade byggdelar definierade i Mat 8, tabell A. \n4. Beskrivning av respektive byggvaras mängd och placering (dokumenterade i Tabell A).\n",{"$f":"$D22","v":"One credit where evidence provided demonstrates the provision of a simple guide that covers information relevant to the tenant/occupants and non-technical building manager on the operation and environmental performance of the building."},null,{"$f":"IF(HC=\"y\",AE22,+IF(Ret=\"y\",AG22,+IF(OFF=\"y\",AI22,+IF(TOYOTA=\"y\",AU22,+IF(PRISONS=\"y\",AM22,+IF(SCHOOLS=\"y\",AO22,+IF(FE=\"y\",AQ22,+IF(INDUSTRIAL=\"y\",AS22))))))))","v":2},null,null,null,null,0,null,null,null,{"$f":"IF(OR(islike($V22,\"*2*\"),islike($V22,\"*1B*\")),EY22*0.5,EY22)","v":{"$error":"#NAME?"}},{"$f":"IF(OR(islike($V22,\"*2*\"),islike($V22,\"*1B*\")),EZ22*0.5,EZ22)","v":{"$error":"#NAME?"}},{"$f":"IF(OR(islike($V22,\"*2*\"),islike($V22,\"*1B*\")),FA22*0.5,FA22)","v":{"$error":"#NAME?"}},{"$f":"IF(OR(islike($V22,\"*2*\"),islike($V22,\"*1B*\")),FB22*0.5,FB22)","v":{"$error":"#NAME?"}},{"$f":"IF(OR(islike($V22,\"*2*\"),islike($V22,\"*1B*\")),FC22*0.5,FC22)","v":{"$error":"#NAME?"}},null,null,null,null,2,2,2,2,null,null,null,null,null,null,null,null,2,2,2,2,2,null,null,null,1,null,null,null,null,null,null,null,null,null,null,null,null,null,1,"Y",null,2,null,null,null,null,null,null,null,null,2,"Y",null,1,null,null,1,"Y",null,1,null,null,null,null,null,null,null,1,"Y",null,2,null,null,null,null,null,null,null,null,null,null,null,null,null,null,null,null,null,null,null,2,"Y",null,1,null,null,null,null,null,null,null,null,null,null,1,"Y",null,2,null,null,null,null,null,null,null,null,null,null,null,null,null,null,2,"Y",null,null,0,1,1,1,1]
[null,"Man 5","Site Investigation",null,null,"N/A","N/A",{"$f":"$E23","v":0},null,null,null,"N/A","N/A",null,0,null,null,null,null,0,null,null,null,{"$f":"IF(OR(islike($V23,\"*2*\"),islike($V23,\"*1B*\")),EY23*0.5,EY23)","v":{"$error":"#NAME?"}},{"$f":"IF(OR(islike($V23,\"*2*\"),islike($V23,\"*1B*\")),EZ23*0.5,EZ23)","v":{"$error":"#NAME?"}},{"$f":"IF(OR(islike($V23,\"*2*\"),islike($V23,\"*1B*\")),FA23*0.5,FA23)","v":{"$error":"#NAME?"}},{"$f":"IF(OR(islike($V23,\"*2*\"),islike($V23,\"*1B*\")),FB23*0.5,FB23)","v":{"$error":"#NAME?"}},{"$f":"IF(OR(islike($V23,\"*2*\"),islike($V23,\"*1B*\")),FC23*0.5,FC23)","v":{"$error":"#NAME?"}},null,null,null,null,0,0,0,0,null,null,null,null,null,null,null,null,0,0,0,0,0,null,null,null,null,null,null,null,null,null,null,null,null,null,null,null,null,null,0,"N",null,null,null,null,null,null,null,null,null,null,0,"N",null,0,null,null,0,"N",null,0,null,null,null,null,null,null,null,0,"N",null,0,null,null,null,null,null,null,null,null,null,null,null,null,null,null,null,null,null,null,null,0,"N",null,1,null,null,null,null,null,null,null,null,null,null,1,"Y",null,0,null,null,null,null,null,null,null,null,null,null,null,null,null,null,0,"N",null,null,0,0,0,0,0]
[null,"Man 6","Consultation","One credit where evidence provided demonstrates that consultation has been, or is being, undertaken and feedback given to the local community and building users. In addition, advice should also have been sought from any relevant national and local history, archaeological bodies or military history groups regarding the heritage value of the building/site/surroundings.\n\nTwo credits where, in addition to the above, evidence provided demonstrates that changes to the design and/or action has been taken as a result of the above consultation process. This should include the protection of any parts of the building (or site) having historic or heritage value in accordance with independent advice from the relevant body.",null,"N/A","N/A",{"$f":"$D24","v":"One credit where evidence provided demonstrates that consultation has been, or is being, undertaken and feedback given to the local community and building users. In addition, advice should also have been sought from any relevant national and local history, archaeological bodies or military history groups regarding the heritage value of the building/site/surroundings.\n\nTwo credits where, in addition to the above, evidence provided demonstrates that changes to the design and/or action has been taken as a result of the above consultation process. This should include the protection of any parts of the building (or site) having historic or heritage value in accordance with independent advice from the relevant body."},null,null,null,"N/A","N/A",null,0,null,null,null,null,0,null,null,null,{"$f":"IF(OR(islike($V24,\"*2*\"),islike($V24,\"*1B*\")),EY24*0.5,EY24)","v":{"$error":"#NAME?"}},{"$f":"IF(OR(islike($V24,\"*2*\"),islike($V24,\"*1B*\")),EZ24*0.5,EZ24)","v":{"$error":"#NAME?"}},{"$f":"IF(OR(islike($V24,\"*2*\"),islike($V24,\"*1B*\")),FA24*0.5,FA24)","v":{"$error":"#NAME?"}},{"$f":"IF(OR(islike($V24,\"*2*\"),islike($V24,\"*1B*\")),FB24*0.5,FB24)","v":{"$error":"#NAME?"}},{"$f":"IF(OR(islike($V24,\"*2*\"),islike($V24,\"*1B*\")),FC24*0.5,FC24)","v":{"$error":"#NAME?"}},null,null,null,null,0,0,0,0,null,null,null,null,null,null,null,null,0,0,0,0,0,null,null,null,1,null,null,null,null,null,null,null,null,null,null,null,null,null,1,"Y",null,null,null,null,null,null,null,null,null,null,0,"N",null,1,null,null,1,{"$f":"IF(CG24>=0.1,\"Y\",\"N\")","v":"Y"},null,1,null,null,null,null,null,null,null,1,"Y",null,0,null,null,null,null,null,null,null,null,null,null,null,null,null,null,null,null,null,null,null,0,"N",null,1,null,null,null,null,null,null,null,null,null,null,1,"Y",null,0,null,null,null,null,null,null,null,null,null,null,null,null,null,null,0,"N",null,null,0,0,0,0,0]
[null,"Man 7","Shared Facilities","One credit where evidence provided demonstrates that shared facilities have been provided as a consequence of consultation feedback.\n\nTwo credits where, in addition to the above, evidence provided demonstrates that these facilities can be accessed without compromising the safety and security of the building and its occupants.",null,"N/A","N/A","N/A",null,null,null,"N/A","N/A",null,0,null,null,null,null,{"$f":"IF(partnewpartrefurb=\"y\",Q25,0)","v":0},null,null,null,{"$f":"IF(OR(islike($V25,\"*2*\"),islike($V25,\"*1B*\")),EY25*0.5,EY25)","v":{"$error":"#NAME?"}},{"$f":"IF(OR(islike($V25,\"*2*\"),islike($V25,\"*1B*\")),EZ25*0.5,EZ25)","v":{"$error":"#NAME?"}},{"$f":"IF(OR(islike($V25,\"*2*\"),islike($V25,\"*1B*\")),FA25*0.5,FA25)","v":{"$error":"#NAME?"}},{"$f":"IF(OR(islike($V25,\"*2*\"),islike($V25,\"*1B*\")),FB25*0.5,FB25)","v":{"$error":"#NAME?"}},{"$f":"IF(OR(islike($V25,\"*2*\"),islike($V25,\"*1B*\")),FC25*0.5,FC25)","v":{"$error":"#NAME?"}},null,null,null,null,0,0,0,0,null,null,null,null,null,null,null,null,0,0,0,0,0,null,null,null,null,null,null,{"$f":"IF(communitymentalhealth=\"y\",1,0)","v":0},{"$f":"IF(GP=\"y\",1,0)","v":0},{"$f":"IF(healthcentreclinic=\"y\",1,0)","v":0},null,null,null,null,null,null,null,null,0,"N",null,null,null,null,null,null,null,null,null,null,0,"N",null,0,null,null,0,"N",null,0,null,null,null,null,null,null,null,0,"N",null,0,null,null,null,null,null,null,null,null,null,null,null,null,null,null,null,null,null,null,null,0,"N",null,1,null,null,null,null,null,null,null,null,null,null,1,"Y",null,0,null,null,null,null,null,null,null,null,null,null,null,null,null,null,0,"N",null,null,0,0,0,0,0]
[null,"Man 8","Security","One credit where evidence provided demonstrates that an Architectural Liaison Officer (ALO) or Crime Prevention Design Advisor (CPDA) from the local police force has been consulted at the design stage and their recommendations incorporated into the design of the building and its parking facilities (if relevant).",null,"N/A","N/A",{"$f":"$D26","v":"One credit where evidence provided demonstrates that an Architectural Liaison Officer (ALO) or Crime Prevention Design Advisor (CPDA) from the local police force has been consulted at the design stage and their recommendations incorporated into the design of the building and its parking facilities (if relevant)."},null,null,null,"N/A","N/A",null,0,null,null,null,null,{"$f":"IF(partnewpartrefurb=\"y\",Q26,0)","v":0},null,null,null,{"$f":"IF(OR(islike($V26,\"*2*\"),islike($V26,\"*1B*\")),EY26*0.5,EY26)","v":{"$error":"#NAME?"}},{"$f":"IF(OR(islike($V26,\"*2*\"),islike($V26,\"*1B*\")),EZ26*0.5,EZ26)","v":{"$error":"#NAME?"}},{"$f":"IF(OR(islike($V26,\"*2*\"),islike($V26,\"*1B*\")),FA26*0.5,FA26)","v":{"$error":"#NAME?"}},{"$f":"IF(OR(islike($V26,\"*2*\"),islike($V26,\"*1B*\")),FB26*0.5,FB26)","v":{"$error":"#NAME?"}},{"$f":"IF(OR(islike($V26,\"*2*\"),islike($V26,\"*1B*\")),FC26*0.5,FC26)","v":{"$error":"#NAME?"}},null,null,null,null,0,0,0,0,null,null,null,null,null,null,null,null,0,0,0,0,0,null,null,null,1,null,null,null,null,null,null,null,null,null,null,null,null,null,1,"Y",null,null,null,null,null,null,null,null,null,null,0,"N",null,1,null,null,1,"Y",null,null,null,null,null,null,null,null,{"$f":"IF(PRIparking=\"y\",1,0)","v":0},0,"N",null,0,null,null,null,null,null,null,null,null,null,null,null,null,null,null,null,null,null,null,null,0,"N",null,0,null,null,null,null,null,null,null,null,null,null,0,"N",null,0,null,null,null,null,null,null,null,null,null,null,null,null,null,null,0,"N",null,null,0,0,0,0,0]
[null,"Man 9","Publication of building information",null,null,"N/A","N/A",{"$f":"$E27","v":0},null,null,null,"N/A","N/A",null,0,null,null,null,null,{"$f":"IF(partnewpartrefurb=\"y\",Q27,0)","v":0},null,null,null,{"$f":"IF(OR(islike($V27,\"*2*\"),islike($V27,\"*1B*\")),EY27*0.5,EY27)","v":{"$error":"#NAME?"}},{"$f":"IF(OR(islike($V27,\"*2*\"),islike($V27,\"*1B*\")),EZ27*0.5,EZ27)","v":{"$error":"#NAME?"}},{"$f":"IF(OR(islike($V27,\"*2*\"),islike($V27,\"*1B*\")),FA27*0.5,FA27)","v":{"$error":"#NAME?"}},{"$f":"IF(OR(islike($V27,\"*2*\"),islike($V27,\"*1B*\")),FB27*0.5,FB27)","v":{"$error":"#NAME?"}},{"$f":"IF(OR(islike($V27,\"*2*\"),islike($V27,\"*1B*\")),FC27*0.5,FC27)","v":{"$error":"#NAME?"}},null,null,null,null,0,0,0,0,null,null,null,null,null,null,null,null,0,0,0,0,0,null,null,null,null,null,null,null,null,null,null,null,null,null,null,null,null,null,0,"N",null,null,null,null,null,null,null,null,null,null,0,"N",null,0,null,null,0,"N",null,0,null,null,null,null,null,null,null,0,"N",null,0,null,null,null,null,null,null,null,null,null,null,null,null,null,null,null,null,null,null,null,0,"N",null,1,null,null,null,null,null,null,null,null,null,null,1,"Y",null,0,null,null,null,null,null,null,null,null,null,null,null,null,null,null,0,"N",null,null,0,0,0,0,0]
[null,"Man 10","Development as a learning resource",null,null,"N/A","N/A",{"$f":"$E28","v":0},null,null,null,"N/A","N/A",null,0,null,null,null,null,{"$f":"IF(partnewpartrefurb=\"y\",Q28,0)","v":0},null,null,null,{"$f":"IF(OR(islike($V28,\"*2*\"),islike($V28,\"*1B*\")),EY28*0.5,EY28)","v":{"$error":"#NAME?"}},{"$f":"IF(OR(islike($V28,\"*2*\"),islike($V28,\"*1B*\")),EZ28*0.5,EZ28)","v":{"$error":"#NAME?"}},{"$f":"IF(OR(islike($V28,\"*2*\"),islike($V28,\"*1B*\")),FA28*0.5,FA28)","v":{"$error":"#NAME?"}},{"$f":"IF(OR(islike($V28,\"*2*\"),islike($V28,\"*1B*\")),FB28*0.5,FB28)","v":{"$error":"#NAME?"}},{"$f":"IF(OR(islike($V28,\"*2*\"),islike($V28,\"*1B*\")),FC28*0.5,FC28)","v":{"$error":"#NAME?"}},null,null,null,null,0,0,0,0,null,null,null,null,null,null,null,null,0,0,0,0,0,null,null,null,null,null,null,null,null,null,null,null,null,null,null,null,null,null,0,"N",null,null,null,null,null,null,null,null,null,null,0,"N",null,0,null,null,0,"N",null,0,null,null,null,null,null,null,null,0,"N",null,0,null,null,null,null,null,null,null,null,null,null,null,null,null,null,null,null,null,null,null,0,"N",null,1,null,null,null,null,null,null,null,null,null,null,1,"Y",null,0,null,null,null,null,null,null,null,null,null,null,null,null,null,null,0,"N",null,null,0,0,0,0,0]
[null,"Man 11","Ease of Maintenance","One credit where evidence provided demonstrates that specifications for the building and the building services/systems and landscaping have considered ease and efficiency of maintenance in line with best practice.",null,"N/A","N/A","N/A",null,null,null,"N/A","N/A",null,0,null,null,null,null,{"$f":"IF(partnewpartrefurb=\"y\",(Q29*$Q$16)+(R29*$R$16),0)","v":0},null,null,null,{"$f":"IF(OR(islike($V29,\"*2*\"),islike($V29,\"*1B*\")),EY29*0.5,EY29)","v":{"$error":"#NAME?"}},{"$f":"IF(OR(islike($V29,\"*2*\"),islike($V29,\"*1B*\")),EZ29*0.5,EZ29)","v":{"$error":"#NAME?"}},{"$f":"IF(OR(islike($V29,\"*2*\"),islike($V29,\"*1B*\")),FA29*0.5,FA29)","v":{"$error":"#NAME?"}},{"$f":"IF(OR(islike($V29,\"*2*\"),islike($V29,\"*1B*\")),FB29*0.5,FB29)","v":{"$error":"#NAME?"}},{"$f":"IF(OR(islike($V29,\"*2*\"),islike($V29,\"*1B*\")),FC29*0.5,FC29)","v":{"$error":"#NAME?"}},null,null,null,null,0,0,0,0,null,null,null,null,null,null,null,null,0,0,0,0,0,null,null,null,1,null,null,null,null,null,null,null,null,null,null,null,null,null,1,"Y",null,null,null,null,null,null,null,null,null,null,0,"N",null,0,null,null,0,"N",null,0,null,null,null,null,null,null,null,0,"N",null,0,null,null,null,null,null,null,null,null,null,null,null,null,null,null,null,null,null,null,null,0,"N",null,1,null,null,null,null,null,null,null,null,null,null,1,"Y",null,0,null,null,null,null,null,null,null,null,null,null,null,null,null,null,0,"N",null,null,0,0,0,0,0]
[null,"Man 12","Analys av livscykelkostnader (LCC)","One credit where evidence provided demonstrates that a Life Cycle Cost (LCC) analysis based on the feasibility study proposals has been undertaken on the building design at a strategic and system level.\n\nTwo credits where, in addition to the above, evidence provided demonstrates that the results of the feasibility study and consideration of LCC have been implemented.",null,"Första poängen\n1. LCC-analyser har genomförts på förslag som lagts fram under ”concept design/design develop-ment” eller motsvarande.\n2. LCC-analyserna baseras på förslag från ”concept design/design development” eller tidigare och in-kluderar:\na. Byggskede\nb. Drift - inklusive utrustning\nc. Underhåll – minst planerat underhåll, utbyte, reparation, rengöring och förvaltningskostnader.\nd. Rivning\n3. LCC-analyser sker för 25 eller 30 år (om tillämpligt) och för 60 år, redovisade som diskonterat realt kassaflöde.\n4. Minst två av följande byggnadsdelar ska analyseras på strategisk- och systemnivå (se figur 6, ISO 15686-5:2008, Buildings and Constructed assets): \na. Stomme\nb. Klimatskal\nc. Tekniska installationer\nd. Ytskikt\nDe lösningar väljs som bäst uppfyller prestandakraven för byggnaden.\n\n5. Alternativ med lägst diskonterat realt kassaflöde, LCC under perioden föredras och dessa resulterat i minst ett av följande: \na. Lägst energianvändning under byggnadens driftstid (i förhållande till jämförbara alternativ)\nb. Minskning av underhållsbehov/frekvens\nc. Längre bytesintervaller för installationstekniska system eller byggnadskonstruktioner\nd. Rivning och återvinning eller återanvändning av byggnadsdelar\n6. Modellen uppdateras senast i detaljskedet eller motsvarande.\n\nAndra poängen\n1. Första poängen har uppnåtts.\n2. Resultaten från förstudien har implementerats i handlingar, utformning och i färdig byggnad.\n","Första poängen\n1. LCC-analyser har genomförts på förslag som lagts fram under ”concept design/design development” eller motsvarande.\n2. LCC-analyserna baseras på förslag från ”concept design/design development” eller tidigare och in-kluderar:\na. Byggskede\nb. Drift - inklusive utrustning\nc. Underhåll – minst planerat underhåll, utbyte, reparation, rengöring och förvaltningskostnader.\nd. Rivning\n3. LCC-analyser sker för 25 eller 30 år (om tillämpligt) och för 60 år, redovisade som diskonterat realt kassaflöde.\n4. Minst två av följande byggnadsdelar ska analyseras på strategisk- och systemnivå (se figur 6, ISO 15686-5:2008, Buildings and Constructed assets): \na. Stomme\nb. Klimatskal\nc. Tekniska installationer\nd. Ytskikt\nDe lösningar väljs som bäst uppfyller prestandakraven för byggnaden.\n\n5. Alternativ med lägst diskonterat realt kassaflöde, LCC under perioden föredras och dessa resulterat i minst ett av följande: \na. Lägst energianvändning under byggnadens driftstid (i förhållande till jämförbara alternativ)\nb. Minskning av underhållsbehov/frekvens\nc. Längre bytesintervaller för installationstekniska system eller byggnadskonstruktioner\nd. Rivning och återvinning eller återanvändning av byggnadsdelar\n6. Modellen uppdateras senast i detaljskedet eller motsvarande.\n\nAndra poängen\n1. Första poängen har uppnåtts.\n2. Resultaten från förstudien har implementerats i handlingar, utformning och i färdig byggnad.\n",{"$f":"$D30","v":"One credit where evidence provided demonstrates that a Life Cycle Cost (LCC) analysis based on the feasibility study proposals has been undertaken on the building design at a strategic and system level.\n\nTwo credits where, in addition to the above, evidence provided demonstrates that the results of the feasibility study and consideration of LCC have been implemented."},null,null,null,"Första poängen\n1. LCC-analyser har genomförts på förslag som lagts fram under ”concept design/design develop-ment” eller motsvarande.\n2. LCC-analyserna baseras på förslag från ”concept design/design development” eller tidigare och in-kluderar:\na. Byggskede\nb. Drift - inklusive utrustning\nc. Underhåll – minst planerat underhåll, utbyte, reparation, rengöring och förvaltningskostnader.\nd. Rivning\n3. LCC-analyser sker för 25 eller 30 år (om tillämpligt) och för 60 år, redovisade som diskonterat realt kassaflöde.\n4. Minst två av följande byggnadsdelar ska analyseras på strategisk- och systemnivå (se figur 6, ISO 15686-5:2008, Buildings and Constructed assets): \na. Stomme\nb. Klimatskal\nc. Tekniska installationer\nd. Ytskikt\nDe lösningar väljs som bäst uppfyller prestandakraven för byggnaden.\n\n5. Alternativ med lägst diskonterat realt kassaflöde, LCC under perioden föredras och dessa resulterat i minst ett av följande: \na. Lägst energianvändning under byggnadens driftstid (i förhållande till jämförbara alternativ)\nb. Minskning av underhållsbehov/frekvens\nc. Längre bytesintervaller för installationstekniska system eller byggnadskonstruktioner\nd. Rivning och återvinning eller återanvändning av byggnadsdelar\n6. Modellen uppdateras senast i detaljskedet eller motsvarande.\n\nAndra poängen\n1. Första poängen har uppnåtts.\n2. Resultaten från förstudien har implementerats i handlingar, utformning och i färdig byggnad.\n",{"$f":"$D30","v":"One credit where evidence provided demonstrates that a Life Cycle Cost (LCC) analysis based on the feasibility study proposals has been undertaken on the building design at a strategic and system level.\n\nTwo credits where, in addition to the above, evidence provided demonstrates that the results of the feasibility study and consideration of LCC have been implemented."},null,0,null,null,null,null,{"$f":"IF(partnewpartrefurb=\"y\",Q30,0)","v":0},null,null,null,{"$f":"IF(OR(islike($V30,\"*2*\"),islike($V30,\"*1B*\")),EY30*0.5,EY30)","v":{"$error":"#NAME?"}},{"$f":"IF(OR(islike($V30,\"*2*\"),islike($V30,\"*1B*\")),EZ30*0.5,EZ30)","v":{"$error":"#NAME?"}},{"$f":"IF(OR(islike($V30,\"*2*\"),islike($V30,\"*1B*\")),FA30*0.5,FA30)","v":{"$error":"#NAME?"}},{"$f":"IF(OR(islike($V30,\"*2*\"),islike($V30,\"*1B*\")),FB30*0.5,FB30)","v":{"$error":"#NAME?"}},{"$f":"IF(OR(islike($V30,\"*2*\"),islike($V30,\"*1B*\")),FC30*0.5,FC30)","v":{"$error":"#NAME?"}},null,null,null,null,0,2,0,2,null,null,null,null,null,null,null,null,0,2,0,2,2,null,null,null,1,null,null,null,null,null,null,null,null,null,null,null,null,null,1,"Y",null,null,{"$f":"IF(Offnewrefurb=\"Y\",1,0)","v":0},null,null,null,null,null,null,null,0,"N",null,1,null,null,1,"Y",null,1,null,null,null,null,null,null,null,1,"Y",null,0,{"$f":"IF(RETnewrefurb=\"Y\",1,0)","v":0},null,null,null,null,null,null,null,null,null,null,null,null,null,null,null,null,null,null,0,"N",null,1,null,null,null,null,null,null,null,null,null,null,1,"Y",null,0,{"$f":"IF(INDnewrefurb=\"Y\",1,0)","v":0},null,null,null,null,null,null,null,null,null,null,null,null,null,0,"N",null,null,0,0,0,0,0]
[null,"Man 13","Good Corporate Citizen",null,null,"N/A","N/A","N/A",null,null,null,"N/A","N/A",null,0,null,null,null,null,{"$f":"IF(partnewpartrefurb=\"y\",Q31,0)","v":0},null,null,null,{"$f":"IF(OR(islike($V31,\"*2*\"),islike($V31,\"*1B*\")),EY31*0.5,EY31)","v":{"$error":"#NAME?"}},{"$f":"IF(OR(islike($V31,\"*2*\"),islike($V31,\"*1B*\")),EZ31*0.5,EZ31)","v":{"$error":"#NAME?"}},{"$f":"IF(OR(islike($V31,\"*2*\"),islike($V31,\"*1B*\")),FA31*0.5,FA31)","v":{"$error":"#NAME?"}},{"$f":"IF(OR(islike($V31,\"*2*\"),islike($V31,\"*1B*\")),FB31*0.5,FB31)","v":{"$error":"#NAME?"}},{"$f":"IF(OR(islike($V31,\"*2*\"),islike($V31,\"*1B*\")),FC31*0.5,FC31)","v":{"$error":"#NAME?"}},null,null,null,null,0,0,0,0,null,null,null,null,null,null,null,null,0,0,0,0,0,null,null,null,1,null,null,null,null,null,null,null,null,null,null,null,null,null,1,"Y",null,null,null,null,null,null,null,null,null,null,0,"N",null,0,null,null,0,"N",null,0,null,null,null,null,null,null,null,0,"N",null,0,null,null,null,null,null,null,null,null,null,null,null,null,null,null,null,null,null,null,null,0,"N",null,0,null,null,null,null,null,null,null,null,null,null,0,"N",null,0,null,null,null,null,null,null,null,null,null,null,null,null,null,null,0,"N",null,null,0,0,0,0,0]
[null,"Man 14","AP",null,null,"Första poängen\n1. BREEAMs prestandamål bestäms senast under projekteringsskedet. \n2. En BREEAM-SE AP ges möjlighet att delta i alla viktiga möten med projekteringsgruppen från start, under skisskedet och fram till projekteringsskedets slut. \n\nAndra poängen\n1. Första poängen har uppnåtts.\n2. BREEAM-SE AP har gjort en eller flera utvärderingar i projektet relaterade till BREEAM-SE och be-tygsnivå.\n3. Projektets BREEAM-SE AP ges möjlighet att delta i viktiga möten fram till överlämning.\n\nTredje poängen\n1. Första och andra poängen har uppnåtts.\n2. När projektet/byggnaden kan dokumentera att målnivån enligt första poängen eller högre har uppnåtts.\n\n","Första poängen\n1. BREEAMs prestandamål bestäms senast under projekteringsskedet. \n2. En BREEAM-SE AP ges möjlighet att delta i alla viktiga möten med projekteringsgruppen från start, under skisskedet och fram till projekteringsskedets slut. \n\nAndra poängen\n1. Första poängen har uppnåtts.\n2. BREEAM-SE AP har gjort en eller flera utvärderingar i projektet relaterade till BREEAM-SE och betygsnivå.\n3. Projektets BREEAM-SE AP ges möjlighet att delta i viktiga möten fram till överlämning.\n\nTredje poängen\n1. Första och andra poängen har uppnåtts.\n2. När projektet/byggnaden kan dokumentera att målnivån enligt första poängen eller högre har uppnåtts.\n\n",null,null,null,null,"Första poängen\n1. BREEAMs prestandamål bestäms senast under projekteringsskedet. \n2. En BREEAM-SE AP ges möjlighet att delta i alla viktiga möten med projekteringsgruppen från start, under skisskedet och fram till projekteringsskedets slut. \n\nAndra poängen\n1. Första poängen har uppnåtts.\n2. BREEAM-SE AP har gjort en eller flera utvärderingar i projektet relaterade till BREEAM-SE och be-tygsnivå.\n3. Projektets BREEAM-SE AP ges möjlighet att delta i viktiga möten fram till överlämning.\n\nTredje poängen\n1. Första och andra poängen har uppnåtts.\n2. När projektet/byggnaden kan dokumentera att målnivån enligt första poängen eller högre har upp-nåtts.",null,null,3,null,null,null,null,{"$f":"IF(partnewpartrefurb=\"y\",Q32,0)","v":0},null,null,null,{"$f":"IF(OR(islike($V32,\"*2*\"),islike($V32,\"*1B*\")),EY32*0.5,EY32)","v":{"$error":"#NAME?"}},{"$f":"IF(OR(islike($V32,\"*2*\"),islike($V32,\"*1B*\")),EZ32*0.5,EZ32)","v":{"$error":"#NAME?"}},{"$f":"IF(OR(islike($V32,\"*2*\"),islike($V32,\"*1B*\")),FA32*0.5,FA32)","v":{"$error":"#NAME?"}},{"$f":"IF(OR(islike($V32,\"*2*\"),islike($V32,\"*1B*\")),FB32*0.5,FB32)","v":{"$error":"#NAME?"}},{"$f":"IF(OR(islike($V32,\"*2*\"),islike($V32,\"*1B*\")),FC32*0.5,FC32)","v":{"$error":"#NAME?"}},null,null,null,null,3,3,3,3,null,null,null,null,null,null,null,null,3,3,3,3,3,null,null,null,null,null,null,null,null,null,null,null,null,null,null,null,null,null,{"$f":"SUM(BA32:BN32)","v":0},{"$f":"IF(BO32>=0.1,\"Y\",\"N\")","v":"N"},null,3,null,null,null,null,null,null,null,null,3,"Y",null,null,null,null,null,null,null,null,null,null,null,null,null,null,null,null,null,null,3,null,null,null,null,null,null,null,null,null,null,null,null,null,null,null,null,null,null,null,3,{"$f":"IF(DO32>=0.1,\"Y\",\"N\")","v":"Y"},null,null,null,null,null,null,null,null,null,null,null,null,null,null,null,3,null,null,null,null,null,null,null,null,null,null,null,null,null,null,3,"Y",null,null,0,0,0,0,0]
[null,"Man 15","Fukt",null,null,"Första poängen\n1. Byggnaden utformas, planeras, projekteras och byggs enligt BBR Kap 6:5, det vill säga fuktkritiska konstruktioner identifieras och dokumenteras, kontrollplaner upprättas och genomförandet dokumenteras. \n2. Aktuella relevanta branschregler följs, till exempel Säker vatteninstallation.\n3. I fuktsäkerhetsarbetet används Bygga F eller motsvarande. \n4. Mätning av fukt i betong utförs enligt riktlinjerna från RBK (Rådet för Byggkompetens).\n\nAndra poängen\n1. Första poängen har uppnåtts. \n2. En diplomerad fuktsakkunnig (byggherrens expert) anlitas och en fuktsäkerhetsansvarig (entrepre-nörens expert) har utsetts.","Första poängen\n1. Byggnaden utformas, planeras, projekteras och byggs enligt BBR Kap 6:5, det vill säga fuktkritiska konstruktioner identifieras och dokumenteras, kontrollplaner upprättas och genomförandet dokumenteras. \n2. Aktuella relevanta branschregler följs, till exempel Säker vatteninstallation.\n3. I fuktsäkerhetsarbetet används Bygga F eller motsvarande. \n4. Mätning av fukt i betong utförs enligt riktlinjerna från RBK (Rådet för Byggkompetens).\n\nAndra poängen\n1. Första poängen har uppnåtts. \n2. En diplomerad fuktsakkunnig (byggherrens expert) anlitas och en fuktsäkerhetsansvarig (entreprenörens expert) har utsetts.",null,null,null,null,"Första poängen\n1. Byggnaden utformas, planeras, projekteras och byggs enligt BBR Kap 6:5, det vill säga fuktkritiska konstruktioner identifieras och dokumenteras, kontrollplaner upprättas och genomförandet dokumenteras. \n2. Aktuella relevanta branschregler följs, till exempel Säker vatteninstallation.\n3. I fuktsäkerhetsarbetet används Bygga F eller motsvarande. \n4. Mätning av fukt i betong utförs enligt riktlinjerna från RBK (Rådet för Byggkompetens).\n\nAndra poängen\n1. Första poängen har uppnåtts. \n2. En diplomerad fuktsakkunnig (byggherrens expert) anlitas och en fuktsäkerhetsansvarig (entrepre-nörens expert) har utsetts.","N/A",null,2,null,null,null,null,{"$f":"IF(partnewpartrefurb=\"y\",Q33,0)","v":0},null,null,null,{"$f":"IF(OR(islike($V33,\"*2*\"),islike($V33,\"*1B*\")),EY33*0.5,EY33)","v":{"$error":"#NAME?"}},{"$f":"IF(OR(islike($V33,\"*2*\"),islike($V33,\"*1B*\")),EZ33*0.5,EZ33)","v":{"$error":"#NAME?"}},{"$f":"IF(OR(islike($V33,\"*2*\"),islike($V33,\"*1B*\")),FA33*0.5,FA33)","v":{"$error":"#NAME?"}},{"$f":"IF(OR(islike($V33,\"*2*\"),islike($V33,\"*1B*\")),FB33*0.5,FB33)","v":{"$error":"#NAME?"}},{"$f":"IF(OR(islike($V33,\"*2*\"),islike($V33,\"*1B*\")),FC33*0.5,FC33)","v":{"$error":"#NAME?"}},null,null,null,null,2,2,{"$f":"IF(CB33=\"y\",AJ33,0)","v":2},2,3,3,3,3,3,3,3,3,{"$f":"IF(EV33=\"y\",AT33,0)","v":2},2,{"$f":"IF(DP33=\"y\",AV33,0)","v":2},2,2,null,null,null,null,null,null,null,null,null,null,null,null,null,null,null,null,null,{"$f":"SUM(BA33:BN33)","v":0},{"$f":"IF(BO33>=0.1,\"Y\",\"N\")","v":"N"},null,2,null,null,null,null,null,null,null,null,{"$f":"SUM(BR33:BZ33)","v":2},{"$f":"IF(CA33>=0.1,\"Y\",\"N\")","v":"Y"},null,null,null,null,{"$f":"SUM(CD33:CF33)","v":0},{"$f":"IF(CG33>=0.1,\"Y\",\"N\")","v":"N"},null,null,null,null,null,null,null,null,null,{"$f":"SUM(CJ33:CQ33)","v":0},{"$f":"IF(CR33>=0.1,\"Y\",\"N\")","v":"N"},null,2,null,null,null,null,null,null,null,null,null,null,null,null,null,null,null,null,null,null,null,2,{"$f":"IF(DO33>=0.1,\"Y\",\"N\")","v":"Y"},null,null,null,null,null,null,null,null,null,null,null,null,{"$f":"SUM(DR33:EB33)","v":0},{"$f":"IF(EC33>=0.1,\"Y\",\"N\")","v":"N"},null,2,null,null,null,null,null,null,null,null,null,null,null,null,null,null,{"$f":"SUM(EF33:ET33)","v":2},{"$f":"IF(EU33>=0.1,\"Y\",\"N\")","v":"Y"},null,null,0,0,0,0,0]
[null,"Hälsa och Innemiljö"]
[null,"Hea 1","Dagsljus",null,null,"1. I alla typer av projekt ska minst 80 % av ”net lettable floor area” för kontor ha tillräckligt med dags-ljus enligt a – d nedan\na. Genomsnittlig belysningsstyrka (dagsljus) ska vara minst 200 lux under 2650 timmar per år eller så ska genomsnittlig dagsljusfaktor uppfylla kraven i Tabell 7.\nPLUS antingen (b) ELLER (c OCH d) nedan\nb. Jämnhet ska vara minst 0,4 (i utrymmen med glastak, i till exempel atrium ska jämnheten vara minst 0,7) eller dagsljusfaktorn i en punkt vara lägst enligt Tabell 8.\n\nELLER\nc. Utblick mot himlen från skrivbordshöjd (0,7 m) finns.\nOCH\nd. Kriteriet för rumsdjup  d/w +d/HW < 2/(1-RB) är uppfyllt.\nDär:  d = rumsdjup, w = rumsbredd, HW = fönsterhöjd från golvnivå , RB = genomsnittlig reflektans hos ytor i bakre delen av rummet\n\nNotera: Maximalt rumsdjup för olika rumsbredder och fönsterhöjder i sidobelysta rum enligt Ta-bell 10 (se Ytterligare information)\n3. I industribyggnader ska minst 80 % av den operativa arean och alla övriga vistelserum uppfylla:\na. Genomsnittlig belysningsstyrka (dagsljus) ska vara minst 200 lux under 2650 timmar per år eller så ska genomsnittlig dagsljusfaktor uppfylla kraven i Tabell 7 ovan:\nPLUS antingen (b) ELLER (d) ovan\n4. I handelsbyggnader ska minst 35 % av arean för försäljning och gemensamma utrymmen (i före-kommande fall) uppfylla kraven på dagsljusfaktor i Tabell 9.\nKriterier för exemplarisk nivå\nNedan beskrivs kriterierna för att erhålla innovationspoäng för denna BREEAM-indikator.\n1. Minst 80 % av golvytan (i utrymme/rum enligt kriterierna) har en genomsnittlig dagsljusfaktor enligt  Tabell 7, eller en genomsnittlig belysningsstyrka (dagsljus) på 300 lux under 2 650 timmar per år i flervåningsbyggnad, eller 400 lux i envåningsbyggnad.\n2. Kriterier för jämnhet, utblick mot himmel eller rumsdjup är uppfyllda. Om kraven på jämnhet eller på dagsljusfaktor används gäller:\na. Jämnheten ska vara minst 0,4 (i utrymmen med glastak, till exempel i atrium minst 0,7) eller så ska dagsljusfaktor i en punkt klara kraven i Tabell 8:\n3. I handelsbyggnader ska minst 50 % av golvarean i gemensamma utrymmen och 35 % av golvarean i försäljningsutrymme ha dagsljusfaktor i en punkt enligt Tabell 9 eller så är belysningsstyrkan (dagsljuset) i en punkt minst 200 lux under 2 650 timmar per år.","1. I alla typer av projekt ska minst 80 % av ”net lettable floor area” för kontor ha tillräckligt med dags-ljus enligt a – d nedan\na. Genomsnittlig belysningsstyrka (dagsljus) ska vara minst 200 lux under 2650 timmar per år eller så ska genomsnittlig dagsljusfaktor uppfylla kraven i Tabell 7.\nPLUS antingen (b) ELLER (c OCH d) nedan\nb. Jämnhet ska vara minst 0,4 (i utrymmen med glastak, i till exempel atrium ska jämnheten vara minst 0,7) eller dagsljusfaktorn i en punkt vara lägst enligt Tabell 8.\n\nELLER\nc. Utblick mot himlen från skrivbordshöjd (0,7 m) finns.\n\nOCH\nd. Kriteriet för rumsdjup \n d/w +d/HW < 2/(1-RB) är uppfyllt.\nDär:  d = rumsdjup\nw = rumsbredd\nHW = fönsterhöjd från golvnivå \nRB = genomsnittlig reflektans hos ytor i bakre delen av rummet\n\nNotera: Maximalt rumsdjup för olika rumsbredder och fönsterhöjder i sidobelysta rum enligt Ta-bell 10 (se Ytterligare information)\n3. I industribyggnader ska minst 80 % av den operativa arean och alla övriga vistelserum uppfylla:\na. Genomsnittlig belysningsstyrka (dagsljus) ska vara minst 200 lux under 2650 timmar per år eller så ska genomsnittlig dagsljusfaktor uppfylla kraven i Tabell 7 ovan:\nPLUS antingen (b) ELLER (d) ovan\n4. I handelsbyggnader ska minst 35 % av arean för försäljning och gemensamma utrymmen (i före-kommande fall) uppfylla kraven på dagsljusfaktor i Tabell 9.\nKriterier för exemplarisk nivå\nNedan beskrivs kriterierna för att erhålla innovationspoäng för denna BREEAM-indikator.\n1. Minst 80 % av golvytan (i utrymme/rum enligt kriterierna) har en genomsnittlig dagsljusfaktor enligt  Tabell 7, eller en genomsnittlig belysningsstyrka (dagsljus) på 300 lux under 2 650 timmar per år i flervåningsbyggnad, eller 400 lux i envåningsbyggnad.\n2. Kriterier för jämnhet, utblick mot himmel eller rumsdjup är uppfyllda. Om kraven på jämnhet eller på dagsljusfaktor används gäller:\na. Jämnheten ska vara minst 0,4 (i utrymmen med glastak, till exempel i atrium minst 0,7) eller så ska dagsljusfaktor i en punkt klara kraven i Tabell 8:\n3. I handelsbyggnader ska minst 50 % av golvarean i gemensamma utrymmen och 35 % av golvarean i försäljningsutrymme ha dagsljusfaktor i en punkt enligt Tabell 9 eller så är belysningsstyrkan (dagsljuset) i en punkt minst 200 lux under 2 650 timmar per år.","1. I alla typer av projekt ska minst 80 % av ”net lettable floor area” för kontor ha tillräckligt med dags-ljus enligt a – d nedan\na. Genomsnittlig belysningsstyrka (dagsljus) ska vara minst 200 lux under 2650 timmar per år eller så ska genomsnittlig dagsljusfaktor uppfylla kraven i Tabell 7.\nPLUS antingen (b) ELLER (c OCH d) nedan\nb. Jämnhet ska vara minst 0,4 (i utrymmen med glastak, i till exempel atrium ska jämnheten vara minst 0,7) eller dagsljusfaktorn i en punkt vara lägst enligt Tabell 8.\n\nELLER\nc. Utblick mot himlen från skrivbordshöjd (0,7 m) finns.\n\nOCH\nd. Kriteriet för rumsdjup \n d/w +d/HW < 2/(1-RB) är uppfyllt.\nDär:  d = rumsdjup\nw = rumsbredd\nHW = fönsterhöjd från golvnivå \nRB = genomsnittlig reflektans hos ytor i bakre delen av rummet\n\nNotera: Maximalt rumsdjup för olika rumsbredder och fönsterhöjder i sidobelysta rum enligt Ta-bell 10 (se Ytterligare information)\n3. I industribyggnader ska minst 80 % av den operativa arean och alla övriga vistelserum uppfylla:\na. Genomsnittlig belysningsstyrka (dagsljus) ska vara minst 200 lux under 2650 timmar per år eller så ska genomsnittlig dagsljusfaktor uppfylla kraven i Tabell 7 ovan:\nPLUS antingen (b) ELLER (d) ovan\n4. I handelsbyggnader ska minst 35 % av arean för försäljning och gemensamma utrymmen (i före-kommande fall) uppfylla kraven på dagsljusfaktor i Tabell 9.\nKriterier för exemplarisk nivå\nNedan beskrivs kriterierna för att erhålla innovationspoäng för denna BREEAM-indikator.\n1. Minst 80 % av golvytan (i utrymme/rum enligt kriterierna) har en genomsnittlig dagsljusfaktor enligt  Tabell 7, eller en genomsnittlig belysningsstyrka (dagsljus) på 300 lux under 2 650 timmar per år i flervåningsbyggnad, eller 400 lux i envåningsbyggnad.\n2. Kriterier för jämnhet, utblick mot himmel eller rumsdjup är uppfyllda. Om kraven på jämnhet eller på dagsljusfaktor används gäller:\na. Jämnheten ska vara minst 0,4 (i utrymmen med glastak, till exempel i atrium minst 0,7) eller så ska dagsljusfaktor i en punkt klara kraven i Tabell 8:\n3. I handelsbyggnader ska minst 50 % av golvarean i gemensamma utrymmen och 35 % av golvarean i försäljningsutrymme ha dagsljusfaktor i en punkt enligt Tabell 9 eller så är belysningsstyrkan (dagsljuset) i en punkt minst 200 lux under 2 650 timmar per år.","1. I alla typer av projekt ska minst 80 % av ”net lettable floor area” för kontor ha tillräckligt med dags-ljus enligt a – d nedan\na. Genomsnittlig belysningsstyrka (dagsljus) ska vara minst 200 lux under 2650 timmar per år eller så ska genomsnittlig dagsljusfaktor uppfylla kraven i Tabell 7.\nPLUS antingen (b) ELLER (c OCH d) nedan\nb. Jämnhet ska vara minst 0,4 (i utrymmen med glastak, i till exempel atrium ska jämnheten vara minst 0,7) eller dagsljusfaktorn i en punkt vara lägst enligt Tabell 8.\n\nELLER\nc. Utblick mot himlen från skrivbordshöjd (0,7 m) finns.\n\nOCH\nd. Kriteriet för rumsdjup \n d/w +d/HW < 2/(1-RB) är uppfyllt.\nDär:  d = rumsdjup\nw = rumsbredd\nHW = fönsterhöjd från golvnivå \nRB = genomsnittlig reflektans hos ytor i bakre delen av rummet\n\nNotera: Maximalt rumsdjup för olika rumsbredder och fönsterhöjder i sidobelysta rum enligt Ta-bell 10 (se Ytterligare information)\n3. I industribyggnader ska minst 80 % av den operativa arean och alla övriga vistelserum uppfylla:\na. Genomsnittlig belysningsstyrka (dagsljus) ska vara minst 200 lux under 2650 timmar per år eller så ska genomsnittlig dagsljusfaktor uppfylla kraven i Tabell 7 ovan:\nPLUS antingen (b) ELLER (d) ovan\n4. I handelsbyggnader ska minst 35 % av arean för försäljning och gemensamma utrymmen (i före-kommande fall) uppfylla kraven på dagsljusfaktor i Tabell 9.\nKriterier för exemplarisk nivå\nNedan beskrivs kriterierna för att erhålla innovationspoäng för denna BREEAM-indikator.\n1. Minst 80 % av golvytan (i utrymme/rum enligt kriterierna) har en genomsnittlig dagsljusfaktor enligt  Tabell 7, eller en genomsnittlig belysningsstyrka (dagsljus) på 300 lux under 2 650 timmar per år i flervåningsbyggnad, eller 400 lux i envåningsbyggnad.\n2. Kriterier för jämnhet, utblick mot himmel eller rumsdjup är uppfyllda. Om kraven på jämnhet eller på dagsljusfaktor används gäller:\na. Jämnheten ska vara minst 0,4 (i utrymmen med glastak, till exempel i atrium minst 0,7) eller så ska dagsljusfaktor i en punkt klara kraven i Tabell 8:\n3. I handelsbyggnader ska minst 50 % av golvarean i gemensamma utrymmen och 35 % av golvarean i försäljningsutrymme ha dagsljusfaktor i en punkt enligt Tabell 9 eller så är belysningsstyrkan (dagsljuset) i en punkt minst 200 lux under 2 650 timmar per år.","1. I alla typer av projekt ska minst 80 % av ”net lettable floor area” för kontor ha tillräckligt med dags-ljus enligt a – d nedan\na. Genomsnittlig belysningsstyrka (dagsljus) ska vara minst 200 lux under 2650 timmar per år eller så ska genomsnittlig dagsljusfaktor uppfylla kraven i Tabell 7.\nPLUS antingen (b) ELLER (c OCH d) nedan\nb. Jämnhet ska vara minst 0,4 (i utrymmen med glastak, i till exempel atrium ska jämnheten vara minst 0,7) eller dagsljusfaktorn i en punkt vara lägst enligt Tabell 8.\n\nELLER\nc. Utblick mot himlen från skrivbordshöjd (0,7 m) finns.\n\nOCH\nd. Kriteriet för rumsdjup \n d/w +d/HW < 2/(1-RB) är uppfyllt.\nDär:  d = rumsdjup\nw = rumsbredd\nHW = fönsterhöjd från golvnivå \nRB = genomsnittlig reflektans hos ytor i bakre delen av rummet\n\nNotera: Maximalt rumsdjup för olika rumsbredder och fönsterhöjder i sidobelysta rum enligt Ta-bell 10 (se Ytterligare information)\n3. I industribyggnader ska minst 80 % av den operativa arean och alla övriga vistelserum uppfylla:\na. Genomsnittlig belysningsstyrka (dagsljus) ska vara minst 200 lux under 2650 timmar per år eller så ska genomsnittlig dagsljusfaktor uppfylla kraven i Tabell 7 ovan:\nPLUS antingen (b) ELLER (d) ovan\n4. I handelsbyggnader ska minst 35 % av arean för försäljning och gemensamma utrymmen (i före-kommande fall) uppfylla kraven på dagsljusfaktor i Tabell 9.\nKriterier för exemplarisk nivå\nNedan beskrivs kriterierna för att erhålla innovationspoäng för denna BREEAM-indikator.\n1. Minst 80 % av golvytan (i utrymme/rum enligt kriterierna) har en genomsnittlig dagsljusfaktor enligt  Tabell 7, eller en genomsnittlig belysningsstyrka (dagsljus) på 300 lux under 2 650 timmar per år i flervåningsbyggnad, eller 400 lux i envåningsbyggnad.\n2. Kriterier för jämnhet, utblick mot himmel eller rumsdjup är uppfyllda. Om kraven på jämnhet eller på dagsljusfaktor används gäller:\na. Jämnheten ska vara minst 0,4 (i utrymmen med glastak, till exempel i atrium minst 0,7) eller så ska dagsljusfaktor i en punkt klara kraven i Tabell 8:\n3. I handelsbyggnader ska minst 50 % av golvarean i gemensamma utrymmen och 35 % av golvarean i försäljningsutrymme ha dagsljusfaktor i en punkt enligt Tabell 9 eller så är belysningsstyrkan (dagsljuset) i en punkt minst 200 lux under 2 650 timmar per år.","1. I alla typer av projekt ska minst 80 % av ”net lettable floor area” för kontor ha tillräckligt med dags-ljus enligt a – d nedan\na. Genomsnittlig belysningsstyrka (dagsljus) ska vara minst 200 lux under 2650 timmar per år eller så ska genomsnittlig dagsljusfaktor uppfylla kraven i Tabell 7.\nPLUS antingen (b) ELLER (c OCH d) nedan\nb. Jämnhet ska vara minst 0,4 (i utrymmen med glastak, i till exempel atrium ska jämnheten vara minst 0,7) eller dagsljusfaktorn i en punkt vara lägst enligt Tabell 8.\n\nELLER\nc. Utblick mot himlen från skrivbordshöjd (0,7 m) finns.\n\nOCH\nd. Kriteriet för rumsdjup \n d/w +d/HW < 2/(1-RB) är uppfyllt.\nDär:  d = rumsdjup\nw = rumsbredd\nHW = fönsterhöjd från golvnivå \nRB = genomsnittlig reflektans hos ytor i bakre delen av rummet\n\nNotera: Maximalt rumsdjup för olika rumsbredder och fönsterhöjder i sidobelysta rum enligt Ta-bell 10 (se Ytterligare information)\n3. I industribyggnader ska minst 80 % av den operativa arean och alla övriga vistelserum uppfylla:\na. Genomsnittlig belysningsstyrka (dagsljus) ska vara minst 200 lux under 2650 timmar per år eller så ska genomsnittlig dagsljusfaktor uppfylla kraven i Tabell 7 ovan:\nPLUS antingen (b) ELLER (d) ovan\n4. I handelsbyggnader ska minst 35 % av arean för försäljning och gemensamma utrymmen (i före-kommande fall) uppfylla kraven på dagsljusfaktor i Tabell 9.\nKriterier för exemplarisk nivå\nNedan beskrivs kriterierna för att erhålla innovationspoäng för denna BREEAM-indikator.\n1. Minst 80 % av golvytan (i utrymme/rum enligt kriterierna) har en genomsnittlig dagsljusfaktor enligt  Tabell 7, eller en genomsnittlig belysningsstyrka (dagsljus) på 300 lux under 2 650 timmar per år i flervåningsbyggnad, eller 400 lux i envåningsbyggnad.\n2. Kriterier för jämnhet, utblick mot himmel eller rumsdjup är uppfyllda. Om kraven på jämnhet eller på dagsljusfaktor används gäller:\na. Jämnheten ska vara minst 0,4 (i utrymmen med glastak, till exempel i atrium minst 0,7) eller så ska dagsljusfaktor i en punkt klara kraven i Tabell 8:\n3. I handelsbyggnader ska minst 50 % av golvarean i gemensamma utrymmen och 35 % av golvarean i försäljningsutrymme ha dagsljusfaktor i en punkt enligt Tabell 9 eller så är belysningsstyrkan (dagsljuset) i en punkt minst 200 lux under 2 650 timmar per år.","1. I alla typer av projekt ska minst 80 % av ”net lettable floor area” för kontor ha tillräckligt med dags-ljus enligt a – d nedan\na. Genomsnittlig belysningsstyrka (dagsljus) ska vara minst 200 lux under 2650 timmar per år eller så ska genomsnittlig dagsljusfaktor uppfylla kraven i Tabell 7.\nPLUS antingen (b) ELLER (c OCH d) nedan\nb. Jämnhet ska vara minst 0,4 (i utrymmen med glastak, i till exempel atrium ska jämnheten vara minst 0,7) eller dagsljusfaktorn i en punkt vara lägst enligt Tabell 8.\n\nELLER\nc. Utblick mot himlen från skrivbordshöjd (0,7 m) finns.\n\nOCH\nd. Kriteriet för rumsdjup \n d/w +d/HW < 2/(1-RB) är uppfyllt.\nDär:  d = rumsdjup\nw = rumsbredd\nHW = fönsterhöjd från golvnivå \nRB = genomsnittlig reflektans hos ytor i bakre delen av rummet\n\nNotera: Maximalt rumsdjup för olika rumsbredder och fönsterhöjder i sidobelysta rum enligt Ta-bell 10 (se Ytterligare information)\n3. I industribyggnader ska minst 80 % av den operativa arean och alla övriga vistelserum uppfylla:\na. Genomsnittlig belysningsstyrka (dagsljus) ska vara minst 200 lux under 2650 timmar per år eller så ska genomsnittlig dagsljusfaktor uppfylla kraven i Tabell 7 ovan:\nPLUS antingen (b) ELLER (d) ovan\n4. I handelsbyggnader ska minst 35 % av arean för försäljning och gemensamma utrymmen (i före-kommande fall) uppfylla kraven på dagsljusfaktor i Tabell 9.\nKriterier för exemplarisk nivå\nNedan beskrivs kriterierna för att erhålla innovationspoäng för denna BREEAM-indikator.\n1. Minst 80 % av golvytan (i utrymme/rum enligt kriterierna) har en genomsnittlig dagsljusfaktor enligt  Tabell 7, eller en genomsnittlig belysningsstyrka (dagsljus) på 300 lux under 2 650 timmar per år i flervåningsbyggnad, eller 400 lux i envåningsbyggnad.\n2. Kriterier för jämnhet, utblick mot himmel eller rumsdjup är uppfyllda. Om kraven på jämnhet eller på dagsljusfaktor används gäller:\na. Jämnheten ska vara minst 0,4 (i utrymmen med glastak, till exempel i atrium minst 0,7) eller så ska dagsljusfaktor i en punkt klara kraven i Tabell 8:\n3. I handelsbyggnader ska minst 50 % av golvarean i gemensamma utrymmen och 35 % av golvarean i försäljningsutrymme ha dagsljusfaktor i en punkt enligt Tabell 9 eller så är belysningsstyrkan (dagsljuset) i en punkt minst 200 lux under 2 650 timmar per år.","1. I alla typer av projekt ska minst 80 % av ”net lettable floor area” för kontor ha tillräckligt med dags-ljus enligt a – d nedan\na. Genomsnittlig belysningsstyrka (dagsljus) ska vara minst 200 lux under 2650 timmar per år eller så ska genomsnittlig dagsljusfaktor uppfylla kraven i Tabell 7.\nPLUS antingen (b) ELLER (c OCH d) nedan\nb. Jämnhet ska vara minst 0,4 (i utrymmen med glastak, i till exempel atrium ska jämnheten vara minst 0,7) eller dagsljusfaktorn i en punkt vara lägst enligt Tabell 8.\n\nELLER\nc. Utblick mot himlen från skrivbordshöjd (0,7 m) finns.\n\nOCH\nd. Kriteriet för rumsdjup \n d/w +d/HW < 2/(1-RB) är uppfyllt.\nDär:  d = rumsdjup\nw = rumsbredd\nHW = fönsterhöjd från golvnivå \nRB = genomsnittlig reflektans hos ytor i bakre delen av rummet\n\nNotera: Maximalt rumsdjup för olika rumsbredder och fönsterhöjder i sidobelysta rum enligt Ta-bell 10 (se Ytterligare information)\n3. I industribyggnader ska minst 80 % av den operativa arean och alla övriga vistelserum uppfylla:\na. Genomsnittlig belysningsstyrka (dagsljus) ska vara minst 200 lux under 2650 timmar per år eller så ska genomsnittlig dagsljusfaktor uppfylla kraven i Tabell 7 ovan:\nPLUS antingen (b) ELLER (d) ovan\n4. I handelsbyggnader ska minst 35 % av arean för försäljning och gemensamma utrymmen (i före-kommande fall) uppfylla kraven på dagsljusfaktor i Tabell 9.\nKriterier för exemplarisk nivå\nNedan beskrivs kriterierna för att erhålla innovationspoäng för denna BREEAM-indikator.\n1. Minst 80 % av golvytan (i utrymme/rum enligt kriterierna) har en genomsnittlig dagsljusfaktor enligt  Tabell 7, eller en genomsnittlig belysningsstyrka (dagsljus) på 300 lux under 2 650 timmar per år i flervåningsbyggnad, eller 400 lux i envåningsbyggnad.\n2. Kriterier för jämnhet, utblick mot himmel eller rumsdjup är uppfyllda. Om kraven på jämnhet eller på dagsljusfaktor används gäller:\na. Jämnheten ska vara minst 0,4 (i utrymmen med glastak, till exempel i atrium minst 0,7) eller så ska dagsljusfaktor i en punkt klara kraven i Tabell 8:\n3. I handelsbyggnader ska minst 50 % av golvarean i gemensamma utrymmen och 35 % av golvarean i försäljningsutrymme ha dagsljusfaktor i en punkt enligt Tabell 9 eller så är belysningsstyrkan (dagsljuset) i en punkt minst 200 lux under 2 650 timmar per år.",null,{"$f":"IF(HC=\"y\",AE35,+IF(Ret=\"y\",AG35,+IF(OFF=\"y\",AI35,+IF(TOYOTA=\"y\",AU35,+IF(PRISONS=\"y\",AM35,+IF(SCHOOLS=\"y\",AO35,+IF(FE=\"y\",AQ35,+IF(INDUSTRIAL=\"y\",AS35))))))))","v":1},null,null,null,null,{"$f":"IF(partnewpartrefurb=\"y\",(Q35*$Q$16)+(R35*$R$16),0)","v":0},null,null,null,{"$f":"IF(OR(islike($V35,\"*2*\"),islike($V35,\"*1B*\")),EY35*0.5,EY35)","v":{"$error":"#NAME?"}},{"$f":"IF(OR(islike($V35,\"*2*\"),islike($V35,\"*1B*\")),EZ35*0.5,EZ35)","v":{"$error":"#NAME?"}},{"$f":"IF(OR(islike($V35,\"*2*\"),islike($V35,\"*1B*\")),FA35*0.5,FA35)","v":{"$error":"#NAME?"}},{"$f":"IF(OR(islike($V35,\"*2*\"),islike($V35,\"*1B*\")),FB35*0.5,FB35)","v":{"$error":"#NAME?"}},{"$f":"IF(OR(islike($V35,\"*2*\"),islike($V35,\"*1B*\")),FC35*0.5,FC35)","v":{"$error":"#NAME?"}},null,null,null,null,{"$f":"IF(DP35=\"y\",AH35,0)","v":1},1,1,1,null,null,null,null,null,null,null,null,1,1,1,{"$f":"IF(OR(RETofficelarge=\"y\",RETinternalgoods=\"y\"),2,1)","v":1},1,null,null,null,1,null,null,null,null,null,null,null,null,null,null,null,null,null,1,"Y",null,1,null,null,null,null,null,null,null,null,1,"Y",null,1,null,null,1,"Y",null,1,null,null,null,null,null,null,null,1,"Y",null,1,null,null,null,null,null,null,null,null,null,null,null,null,null,null,null,null,null,null,null,{"$f":"SUM(CU35:DN35)","v":1},{"$f":"IF(DO35>=0.1,\"Y\",\"N\")","v":"Y"},null,1,null,null,null,null,null,null,null,null,null,null,1,"Y",null,1,null,null,null,null,null,null,null,null,null,null,null,null,null,null,1,"Y",null,null,0,0,0,0,0]
[null,"Hea 2","Utblick","One credit where evidence provided demonstrates that all relevant building areas have an adequate view out.",null,"1. Relevanta utrymmen i byggnaden finns inom 7 m från vägg med fönster eller från en permanent öppning som ger tillfredsställande utblick, där fönster/öppningar är ≥ 20 % av invändig väggs totala area. \n+F33","1. Relevanta utrymmen i byggnaden finns inom 7 m från vägg med fönster eller från en permanent öppning som ger tillfredsställande utblick, där fönster/öppningar är ≥ 20 % av invändig väggs totala area. \n",{"$f":"$D36","v":"One credit where evidence provided demonstrates that all relevant building areas have an adequate view out."},null,null,null,"1. Relevanta utrymmen i byggnaden finns inom 7 m från vägg med fönster eller från en permanent öppning som ger tillfredsställande utblick, där fönster/öppningar är ≥ 20 % av invändig väggs totala area. \n",{"$f":"$D36","v":"One credit where evidence provided demonstrates that all relevant building areas have an adequate view out."},null,1,null,null,null,null,0,null,null,null,{"$f":"IF(OR(islike($V36,\"*2*\"),islike($V36,\"*1B*\")),EY36*0.5,EY36)","v":{"$error":"#NAME?"}},{"$f":"IF(OR(islike($V36,\"*2*\"),islike($V36,\"*1B*\")),EZ36*0.5,EZ36)","v":{"$error":"#NAME?"}},{"$f":"IF(OR(islike($V36,\"*2*\"),islike($V36,\"*1B*\")),FA36*0.5,FA36)","v":{"$error":"#NAME?"}},{"$f":"IF(OR(islike($V36,\"*2*\"),islike($V36,\"*1B*\")),FB36*0.5,FB36)","v":{"$error":"#NAME?"}},{"$f":"IF(OR(islike($V36,\"*2*\"),islike($V36,\"*1B*\")),FC36*0.5,FC36)","v":{"$error":"#NAME?"}},null,null,null,null,0,1,1,1,null,null,null,null,null,null,null,null,0,1,0,1,null,null,null,null,1,null,null,null,null,null,null,null,null,null,null,null,null,null,1,"Y",null,1,null,null,null,null,null,null,null,null,1,"Y",null,1,null,null,1,"Y",null,1,null,null,null,null,null,null,null,1,"Y",null,null,null,null,null,null,null,null,null,null,null,null,null,null,null,null,null,{"$f":"IF(RETofficelarge=\"Y\",1,0)","v":0},null,null,null,0,"N",null,1,null,null,null,null,null,null,null,null,null,null,1,"Y",null,null,null,null,null,null,null,{"$f":"IF(INDlargeoffice=\"y\",1,0)","v":0},null,null,null,null,null,null,null,null,0,"N",null,null,0,0,0,0,0]
[null,"Hea 3","Bländningskontroll",null,null,"1. Brukarstyrda bländningsskydd ska finnas för alla fönster, glaspartier och takfönster i alla relevanta utrymmen i byggnaden.\n","1. Brukarstyrda bländningsskydd ska finnas för alla fönster, glaspartier och takfönster i alla relevanta utrymmen i byggnaden.\n","One credit where evidence provided demonstrates that an occupant-controlled shading system (e.g. internal or external blinds) is fitted in all relevant building areas and glare in other occupied areas has been minimised through design and specification.",null,null,null,"1. Brukarstyrda bländningsskydd ska finnas för alla fönster, glaspartier och takfönster i alla relevanta utrymmen i byggnaden.\n","One credit where evidence provided demonstrates that an occupant-controlled shading system (e.g. internal or external blinds) is fitted in relevant building areas.",null,1,null,null,null,null,0,null,null,null,{"$f":"IF(OR(islike($V37,\"*2*\"),islike($V37,\"*1B*\")),EY37*0.5,EY37)","v":{"$error":"#NAME?"}},{"$f":"IF(OR(islike($V37,\"*2*\"),islike($V37,\"*1B*\")),EZ37*0.5,EZ37)","v":{"$error":"#NAME?"}},{"$f":"IF(OR(islike($V37,\"*2*\"),islike($V37,\"*1B*\")),FA37*0.5,FA37)","v":{"$error":"#NAME?"}},{"$f":"IF(OR(islike($V37,\"*2*\"),islike($V37,\"*1B*\")),FB37*0.5,FB37)","v":{"$error":"#NAME?"}},{"$f":"IF(OR(islike($V37,\"*2*\"),islike($V37,\"*1B*\")),FC37*0.5,FC37)","v":{"$error":"#NAME?"}},null,null,null,null,0,1,1,1,null,null,null,null,null,null,null,null,0,1,0,1,null,null,null,null,1,null,null,null,null,null,null,null,null,null,null,null,null,null,1,"Y",null,1,null,null,null,null,null,null,null,null,1,"Y",null,1,null,null,1,"Y",null,1,null,null,null,null,null,null,null,1,"Y",null,null,null,null,null,null,null,null,null,null,null,null,null,null,null,null,null,{"$f":"IF(RETofficelarge=\"Y\",1,0)","v":0},null,null,null,0,"N",null,1,null,null,null,null,null,null,null,null,null,null,1,"Y",null,null,null,null,null,null,null,{"$f":"IF(INDlargeoffice=\"y\",1,0)","v":0},null,null,null,null,null,null,null,null,0,"N",null,null,0,0,0,0,0]
[null,"Hea 4","Belysning med högfrekvensdon","One credit where evidence provided demonstrates that high frequency ballasts are installed on all fluorescent and compact fluorescent lamps.",null,"1. Alla lysrör och kompaktlysrör har högfrekventa drivdon.\n","1. Alla lysrör och kompaktlysrör har högfrekventa drivdon.\n",{"$f":"$D38","v":"One credit where evidence provided demonstrates that high frequency ballasts are installed on all fluorescent and compact fluorescent lamps."},null,null,null,"1. Alla lysrör och kompaktlysrör har högfrekventa drivdon.\n",{"$f":"$D38","v":"One credit where evidence provided demonstrates that high frequency ballasts are installed on all fluorescent and compact fluorescent lamps."},null,1,null,null,null,null,0,null,null,null,{"$f":"IF(OR(islike($V38,\"*2*\"),islike($V38,\"*1B*\")),EY38*0.5,EY38)","v":{"$error":"#NAME?"}},{"$f":"IF(OR(islike($V38,\"*2*\"),islike($V38,\"*1B*\")),EZ38*0.5,EZ38)","v":{"$error":"#NAME?"}},{"$f":"IF(OR(islike($V38,\"*2*\"),islike($V38,\"*1B*\")),FA38*0.5,FA38)","v":{"$error":"#NAME?"}},{"$f":"IF(OR(islike($V38,\"*2*\"),islike($V38,\"*1B*\")),FB38*0.5,FB38)","v":{"$error":"#NAME?"}},{"$f":"IF(OR(islike($V38,\"*2*\"),islike($V38,\"*1B*\")),FC38*0.5,FC38)","v":{"$error":"#NAME?"}},null,null,null,null,1,1,1,1,null,null,null,null,null,null,null,null,1,1,1,1,1,null,null,null,1,null,null,null,null,null,null,null,null,null,null,null,null,null,1,"Y",null,1,null,null,null,null,null,null,null,null,1,"Y",null,1,null,null,1,"Y",null,1,null,null,null,null,null,null,null,1,"Y",null,1,null,null,null,null,null,null,null,null,null,null,null,null,null,null,null,null,null,null,null,1,"Y",null,1,null,null,null,null,null,null,null,null,null,null,1,"Y",null,1,null,null,null,null,null,null,null,null,null,null,null,null,null,null,1,"Y",null,null,1,1,1,1,1]
[null,"Hea 5","Ljusnivåer inom- och utomhus","One credit where evidence provided demonstrates that all internal and external lighting, where relevant, is specified in accordance with the appropriate maintained illuminance levels (in lux) recommended by CIBSE.","One credit where evidence provided demonstrates that all internal and external lighting, where relevant, is specified in accordance with the appropriate maintained illuminance levels (in lux) recommended by CIBSE.","1. Nivåer på belysningsstyrkan inom- och utomhus (lux) följer bästa praxis för belysning. Belysnings-strategin för byggnaden ska motsvara nivåer för bästa praxis.  \n2. I utrymmen där datorskärmar används regelbundet, utformas belysningen så att risken för bländ-ning minimeras enligt nationella riktlinjer för bästa praxis, särskilt så att UGR-gränserna uppfylls. \n3. Belysningsstyrkans jämnhet på alla arbetsfält är lika med eller större än 0,7 och jämnheten i omgivande område är minst 0,5. \n","1. Nivåer på belysningsstyrkan inom- och utomhus (lux) följer bästa praxis för belysning. Belysningsstrategin för byggnaden ska motsvara nivåer för bästa praxis.  \n2. I utrymmen där datorskärmar används regelbundet, utformas belysningen så att risken för bländning minimeras enligt nationella riktlinjer för bästa praxis, särskilt så att UGR-gränserna uppfylls. \n3. Belysningsstyrkans jämnhet på alla arbetsfält är lika med eller större än 0,7 och jämnheten i omgi-vande område är minst 0,5. \n",{"$f":"$D39","v":"One credit where evidence provided demonstrates that all internal and external lighting, where relevant, is specified in accordance with the appropriate maintained illuminance levels (in lux) recommended by CIBSE."},null,null,null,"1. Nivåer på belysningsstyrkan inom- och utomhus (lux) följer bästa praxis för belysning. Belysnings-strategin för byggnaden ska motsvara nivåer för bästa praxis.  \n2. I utrymmen där datorskärmar används regelbundet, utformas belysningen så att risken för bländ-ning minimeras enligt nationella riktlinjer för bästa praxis, särskilt så att UGR-gränserna uppfylls. \n3. Belysningsstyrkans jämnhet på alla arbetsfält är lika med eller större än 0,7 och jämnheten i omgi-vande område är minst 0,5. \n","One credit where evidence provided demonstrates that all internal and external lighting, where relevant, is specified in accordance with the appropriate illuminance levels (in lux) in accordance with national best practice guides.",null,1,null,null,null,null,0,null,null,null,{"$f":"IF(OR(islike($V39,\"*2*\"),islike($V39,\"*1B*\")),EY39*0.5,EY39)","v":{"$error":"#NAME?"}},{"$f":"IF(OR(islike($V39,\"*2*\"),islike($V39,\"*1B*\")),EZ39*0.5,EZ39)","v":{"$error":"#NAME?"}},{"$f":"IF(OR(islike($V39,\"*2*\"),islike($V39,\"*1B*\")),FA39*0.5,FA39)","v":{"$error":"#NAME?"}},{"$f":"IF(OR(islike($V39,\"*2*\"),islike($V39,\"*1B*\")),FB39*0.5,FB39)","v":{"$error":"#NAME?"}},{"$f":"IF(OR(islike($V39,\"*2*\"),islike($V39,\"*1B*\")),FC39*0.5,FC39)","v":{"$error":"#NAME?"}},null,null,null,null,1,1,1,1,null,null,null,null,null,null,null,null,1,1,1,1,1,null,null,null,1,null,null,null,null,null,null,null,null,null,null,null,null,null,1,"Y",null,1,null,null,null,null,null,null,null,null,1,"Y",null,1,null,null,1,"Y",null,1,null,null,null,null,null,null,null,1,"Y",null,1,null,null,null,null,null,null,null,null,null,null,null,null,null,null,null,null,null,null,null,1,"Y",null,1,null,null,null,null,null,null,null,null,null,null,1,"Y",null,1,null,null,null,null,null,null,null,null,null,null,null,null,null,null,1,"Y",null,null,0,0,0,0,0]
[null,"Hea 6","Belysningszoner och brukarkontroll","One credit where evidence provided demonstrates that, in all relevant building areas, lighting is appropriately zoned and occupant controllable.",null,"1. Belysningen är zonindelad med separat brukarstyrning i följande utrymmen (där det är relevant):\na. Kontors- och kommunikationsytor\nb. I kontorsutrymmen med högst fyra arbetsplatser i en zon\nc. Arbetsplatser intill fönster/atrium och andra områden i byggnaden som är uppdelade och styrda separat.\nd. Seminarie- och föreläsningssalar: uppdelade i presentation- och åhöraryta.\ne. Bibliotek: separat uppdelning i ytor med bokhyllor, för läsning och med diskar.\n","1. Belysningen är zonindelad med separat brukarstyrning i följande utrymmen (där det är relevant):\na. Kontors- och kommunikationsytor\nb. I kontorsutrymmen med högst fyra arbetsplatser i en zon\nc. Arbetsplatser intill fönster/atrium och andra områden i byggnaden som är uppdelade och styrda separat.\nd. Seminarie- och föreläsningssalar: uppdelade i presentation- och åhöraryta.\ne. Bibliotek: separat uppdelning i ytor med bokhyllor, för läsning och med diskar.\n","One credit where evidence provided demonstrates that, in all relevant building areas, lighting is appropriately zoned and occupant controllable with the option for commonly required lighting settings to be selected quickly and easily.",null,null,null,"1. Belysningen är zonindelad med separat brukarstyrning i följande utrymmen (där det är relevant):\na. Kontors- och kommunikationsytor\nb. I kontorsutrymmen med högst fyra arbetsplatser i en zon\nc. Arbetsplatser intill fönster/atrium och andra områden i byggnaden som är uppdelade och styrda separat.\nd. Seminarie- och föreläsningssalar: uppdelade i presentation- och åhöraryta.\ne. Bibliotek: separat uppdelning i ytor med bokhyllor, för läsning och med diskar.\n",{"$f":"$D40","v":"One credit where evidence provided demonstrates that, in all relevant building areas, lighting is appropriately zoned and occupant controllable."},null,1,null,null,null,null,0,null,null,null,{"$f":"IF(OR(islike($V40,\"*2*\"),islike($V40,\"*1B*\")),EY40*0.5,EY40)","v":{"$error":"#NAME?"}},{"$f":"IF(OR(islike($V40,\"*2*\"),islike($V40,\"*1B*\")),EZ40*0.5,EZ40)","v":{"$error":"#NAME?"}},{"$f":"IF(OR(islike($V40,\"*2*\"),islike($V40,\"*1B*\")),FA40*0.5,FA40)","v":{"$error":"#NAME?"}},{"$f":"IF(OR(islike($V40,\"*2*\"),islike($V40,\"*1B*\")),FB40*0.5,FB40)","v":{"$error":"#NAME?"}},{"$f":"IF(OR(islike($V40,\"*2*\"),islike($V40,\"*1B*\")),FC40*0.5,FC40)","v":{"$error":"#NAME?"}},null,null,null,null,0,1,1,1,null,null,null,null,null,null,null,null,0,1,0,1,null,null,null,null,1,null,null,null,null,null,null,null,null,null,null,null,null,null,1,"Y",null,1,null,null,null,null,null,null,null,null,1,"Y",null,1,null,null,1,"Y",null,0,null,null,null,null,null,null,null,0,"N",null,null,null,null,null,null,null,null,null,null,null,null,null,null,null,null,null,{"$f":"IF(RETofficelarge=\"Y\",1,0)","v":0},null,null,null,0,"N",null,1,null,null,null,null,null,null,null,null,null,null,1,"Y",null,null,null,null,null,null,null,{"$f":"IF(INDlargeoffice=\"y\",1,0)","v":0},null,null,null,null,null,null,null,null,0,"N",null,null,0,0,0,0,0]
[null,"Hea 7","Möjlighet till naturlig ventilation","One credit where evidence provided demonstrates that fresh air is capable of being delivered to the occupied spaces of the building via a natural ventilation strategy, and there is sufficient user-control of the supply of fresh air.",null,"1. Kontoren i byggnaden är utformade så att tillräckligt med ventilationsluft kan tillföras med endast naturlig ventilationsstrategi på NÅGOT av följande sätt: \na. Öppningsbar fönsterarea i varje kontor motsvarar 5 % av rummets golvarea. För rum med djup på 7 m - 15 m finns den öppningsbara fönsterarean på motsatta sidor av rummet och den är jämnt fördelade för att ge tillräcklig ventilation. ELLER\nb. Den valda utformningen (beräknad med designverktyg för ventilation) visar att den naturliga ventilationsstrategin ger tillräcklig genomströmning av luft för kraven på luftflöde och termisk komfort ska vara uppfyllda.\nOm öppningsbara fönster saknas eller kontoren är djupare än 15 m, ska designen visa (beräkning som i 1b ovan) att kraven på luftflöde och termisk komfort är uppfyllda. \n\n2. I den valda strategin finns minst två nivåer för brukarstyrd kontroll av frisklufttillförsel i kontorsutrymmen. Det ska vara möjligt med högre ventilationsflöde sommartid för att eliminera övergående lukter eller undvika övertemperaturer. \n\nNormalt uppfylls detta om tillräckligt många fönster kan öppnas manuellt eller med motordrivna ställdon. Alla öppningsmekanismer ska vara lättillgängliga och kunna kontrolleras så att det inte blir dragigt.\n","1. Kontoren i byggnaden är utformade så att tillräckligt med ventilationsluft kan tillföras med endast naturlig ventilationsstrategi på NÅGOT av följande sätt: \na. Öppningsbar fönsterarea i varje kontor motsvarar 5 % av rummets golvarea. För rum med djup på 7 m - 15 m finns den öppningsbara fönsterarean på motsatta sidor av rummet och den är jämnt fördelade för att ge tillräcklig ventilation. ELLER\nb. Den valda utformningen (beräknad med designverktyg för ventilation) visar att den naturliga ventilationsstrategin ger tillräcklig genomströmning av luft för kraven på luftflöde och termisk komfort ska vara uppfyllda.\nOm öppningsbara fönster saknas eller kontoren är djupare än 15 m, ska designen visa (beräkning som i 1b ovan) att kraven på luftflöde och termisk komfort är uppfyllda. \n\n2. I den valda strategin finns minst två nivåer för brukarstyrd kontroll av frisklufttillförsel i kontorsutrymmen. Det ska vara möjligt med högre ventilationsflöde sommartid för att eliminera övergående lukter eller undvika övertemperaturer. \n\nNormalt uppfylls detta om tillräckligt många fönster kan öppnas manuellt eller med motordrivna ställdon. Alla öppningsmekanismer ska vara lättillgängliga och kunna kontrolleras så att det inte blir dragigt.\n","One credit where evidence provided demonstrates that occupied spaces are primarily naturally ventilated (for typical occupancy), but rely on some mechanical ventilation to assist during peak conditions/load. \n\nTwo credits where evidence provided demonstrates that all occupied spaces are entirely naturally ventilated.",null,null,null,"\n1. Kontoren i byggnaden är utformade så att tillräckligt med ventilationsluft kan tillföras med endast naturlig ventilationsstrategi på NÅGOT av följande sätt: \na. Öppningsbar fönsterarea i varje kontor motsvarar 5 % av rummets golvarea. För rum med djup på 7 m - 15 m finns den öppningsbara fönsterarean på motsatta sidor av rummet och den är jämnt fördelade för att ge tillräcklig ventilation. ELLER\nb. Den valda utformningen (beräknad med designverktyg för ventilation) visar att den naturliga ventilationsstrategin ger tillräcklig genomströmning av luft för kraven på luftflöde och termisk komfort ska vara uppfyllda.\nOm öppningsbara fönster saknas eller kontoren är djupare än 15 m, ska designen visa (beräkning som i 1b ovan) att kraven på luftflöde och termisk komfort är uppfyllda. \n\n2. I den valda strategin finns minst två nivåer för brukarstyrd kontroll av frisklufttillförsel i kontorsut-rymmen. Det ska vara möjligt med högre ventilationsflöde sommartid för att eliminera övergående lukter eller undvika övertemperaturer. \n\nNormalt uppfylls detta om tillräckligt många fönster kan öppnas manuellt eller med motordrivna ställdon. Alla öppningsmekanismer ska vara lättillgängliga och kunna kontrolleras så att det inte blir dragigt.\n","One credit where evidence provided demonstrates that fresh air is capable of being delivered to the occupied spaces of the building via a natural ventilation strategy, and there is sufficient user-control of the supply of fresh air.",null,1,null,null,null,null,0,null,null,null,{"$f":"IF(OR(islike($V41,\"*2*\"),islike($V41,\"*1B*\")),EY41*0.5,EY41)","v":{"$error":"#NAME?"}},{"$f":"IF(OR(islike($V41,\"*2*\"),islike($V41,\"*1B*\")),EZ41*0.5,EZ41)","v":{"$error":"#NAME?"}},{"$f":"IF(OR(islike($V41,\"*2*\"),islike($V41,\"*1B*\")),FA41*0.5,FA41)","v":{"$error":"#NAME?"}},{"$f":"IF(OR(islike($V41,\"*2*\"),islike($V41,\"*1B*\")),FB41*0.5,FB41)","v":{"$error":"#NAME?"}},{"$f":"IF(OR(islike($V41,\"*2*\"),islike($V41,\"*1B*\")),FC41*0.5,FC41)","v":{"$error":"#NAME?"}},null,null,null,null,0,1,1,1,null,null,null,null,null,null,null,null,0,1,0,1,null,null,null,null,1,null,null,null,null,null,null,null,null,null,null,null,null,null,1,"Y",null,1,null,null,null,null,null,null,null,null,1,"Y",null,1,null,null,1,"Y",null,0,null,null,null,null,null,null,null,0,"N",null,null,null,null,null,null,null,null,null,null,null,null,null,null,null,null,null,{"$f":"IF(RETofficelarge=\"Y\",1,0)","v":0},null,null,null,0,"N",null,1,null,null,null,null,null,null,null,null,null,null,1,"Y",null,null,null,null,null,null,null,{"$f":"IF(INDlargeoffice=\"y\",1,0)","v":0},null,null,null,null,null,null,null,null,0,"N",null,null,0,0,0,0,0]
[null,"Hea 8","Luftkvalitet inomhus","One credit where air intakes serving occupied areas avoid major sources of external pollution and recirculation of exhaust air.",null,"1. Byggnader med komfortkyla och kombinationer med andra system: Byggnadens uteluftsintag och avluftsutsläpp placeras så att inte förorenad luft som lämnar byggnaden förs tillbaka till den. Detta enligt bästa praxis, se Förtydligande av bedömningskriterier. \n2. Naturligt ventilerade byggnader: Om öppningsbara fönster/ventilatorer finns, är avståndet minst 10 m till externa föroreningskällor. \n3. Utöver kriterierna ovan har byggnaden utformats för utelufttillförsel enligt BBR sektion 6:22, 6:72 och AFS 2009:2.\n4. I utrymme med stor och svårbestämd eller varierande användningsmönster som i butiker och byggnader för fritidsaktiviteter finns CO2 eller luftkvalitetsgivare och:\na. I mekaniskt ventilerade utrymmen är givarna anslutna till ventilationssystemet för behovsstyr-ning av luftflödet.\nb. I naturligt ventilerade utrymmen slår antingen systemet larm till fastighetsägare/förvaltning när CO2-halten överskrider rekommenderade börvärden, eller så regleras lufttillförseln med auto-matiska fönster/takluckor\n","1. Byggnader med komfortkyla och kombinationer med andra system: Byggnadens uteluftsintag och avluftsutsläpp placeras så att inte förorenad luft som lämnar byggnaden förs tillbaka till den. Detta enligt bästa praxis, se Förtydligande av bedömningskriterier. \n2. Naturligt ventilerade byggnader: Om öppningsbara fönster/ventilatorer finns, är avståndet minst 10 m till externa föroreningskällor. \n3. Utöver kriterierna ovan har byggnaden utformats för utelufttillförsel enligt BBR sektion 6:22, 6:72 och AFS 2009:2.\n4. I utrymme med stor och svårbestämd eller varierande användningsmönster som i butiker och byggnader för fritidsaktiviteter finns CO2 eller luftkvalitetsgivare och:\na. I mekaniskt ventilerade utrymmen är givarna anslutna till ventilationssystemet för behovsstyr-ning av luftflödet.\nb. I naturligt ventilerade utrymmen slår antingen systemet larm till fastighetsägare/förvaltning när CO2-halten överskrider rekommenderade börvärden, eller så regleras lufttillförseln med automatiska fönster/takluckor\n",{"$f":"$D42","v":"One credit where air intakes serving occupied areas avoid major sources of external pollution and recirculation of exhaust air."},null,null,null,"1. Byggnader med komfortkyla och kombinationer med andra system: Byggnadens uteluftsintag och avluftsutsläpp placeras så att inte förorenad luft som lämnar byggnaden förs tillbaka till den. Detta enligt bästa praxis, se Förtydligande av bedömningskriterier. \n2. Naturligt ventilerade byggnader: Om öppningsbara fönster/ventilatorer finns, är avståndet minst 10 m till externa föroreningskällor. \n3. Utöver kriterierna ovan har byggnaden utformats för utelufttillförsel enligt BBR sektion 6:22, 6:72 och AFS 2009:2.\n4. I utrymme med stor och svårbestämd eller varierande användningsmönster som i butiker och byggnader för fritidsaktiviteter finns CO2 eller luftkvalitetsgivare och:\na. I mekaniskt ventilerade utrymmen är givarna anslutna till ventilationssystemet för behovsstyr-ning av luftflödet.\nb. I naturligt ventilerade utrymmen slår antingen systemet larm till fastighetsägare/förvaltning när CO2-halten överskrider rekommenderade börvärden, eller så regleras lufttillförseln med auto-matiska fönster/takluckor\n","One credit where air intakes serving occupied areas avoid major sources of external pollution and recirculation of exhaust air.",null,1,null,null,null,null,0,null,null,null,{"$f":"IF(OR(islike($V42,\"*2*\"),islike($V42,\"*1B*\")),EY42*0.5,EY42)","v":{"$error":"#NAME?"}},{"$f":"IF(OR(islike($V42,\"*2*\"),islike($V42,\"*1B*\")),EZ42*0.5,EZ42)","v":{"$error":"#NAME?"}},{"$f":"IF(OR(islike($V42,\"*2*\"),islike($V42,\"*1B*\")),FA42*0.5,FA42)","v":{"$error":"#NAME?"}},{"$f":"IF(OR(islike($V42,\"*2*\"),islike($V42,\"*1B*\")),FB42*0.5,FB42)","v":{"$error":"#NAME?"}},{"$f":"IF(OR(islike($V42,\"*2*\"),islike($V42,\"*1B*\")),FC42*0.5,FC42)","v":{"$error":"#NAME?"}},null,null,null,null,1,1,1,1,null,null,null,null,null,null,null,null,0,1,1,1,1,null,null,null,1,null,null,null,null,null,null,null,null,null,null,null,null,null,{"$f":"SUM(BA42:BN42)","v":1},"Y",null,1,null,null,null,null,null,null,null,null,1,"Y",null,1,null,null,1,"Y",null,1,null,null,null,null,null,null,null,1,"Y",null,1,null,null,null,null,null,null,null,null,null,null,null,null,null,null,null,null,null,null,null,1,"Y",null,1,null,null,null,null,null,null,null,null,null,null,1,"Y",null,null,null,null,null,null,null,{"$f":"IF(INDlargeoffice=\"y\",1,0)","v":0},null,null,null,null,null,null,null,null,{"$f":"SUM(EG42:ET42)","v":0},"N",null,null,0,0,0,0,0]
[null,"Hea 9","Flyktiga organiska föreningar, VOC","One credit where evidence provided demonstrates that the emissions of VOCs and other substances from key internal finishes and fittings comply with best practice\nlevels.",null,"1. Färger och lacker har testats mot EN ISO 11890-2:2006 Färg och lack. Bestämning av halt flyktiga komponenter. Gaskromatografisk metod och uppfyller fas II gränsvärden för VOC-innehåll i Annex II i direktivet 2004/42/CE. Alla inomhusfärger i våtrum inomhus ska vara resistenta mot svamp och alger.\n2. Minst fem av de sex produktkategorierna i Tabell 11 (där de är specificerade) har testats och upp-fyller relevanta standarder vad gäller halten av flyktiga organiska föreningar (VOC).\n\nKriterier för exemplarisk nivå\nNedan beskrivs de kriterier som ska uppfyllas för en innovationspoäng för denna BREEAM-indikator:\n1. Poängen för Hea 9 ska ha erhållits\n2. Alla produktkategorier nedan (där de är specificerade) har testats och uppfyller relevanta standarder för halter av flyktiga organiska föreningar (VOC). ","1. Färger och lacker har testats mot EN ISO 11890-2:2006 Färg och lack. Bestämning av halt flyktiga komponenter. Gaskromatografisk metod och uppfyller fas II gränsvärden för VOC-innehåll i Annex II i direktivet 2004/42/CE. Alla inomhusfärger i våtrum inomhus ska vara resistenta mot svamp och alger.\n2. Minst fem av de sex produktkategorierna i Tabell 11 (där de är specificerade) har testats och uppfyller relevanta standarder vad gäller halten av flyktiga organiska föreningar (VOC).\n\nKriterier för exemplarisk nivå\nNedan beskrivs de kriterier som ska uppfyllas för en innovationspoäng för denna BREEAM-indikator:\n1. Poängen för Hea 9 ska ha erhållits\n2. Alla produktkategorier nedan (där de är specificerade) har testats och uppfyller relevanta standarder för halter av flyktiga organiska föreningar (VOC). ",{"$f":"$D43","v":"One credit where evidence provided demonstrates that the emissions of VOCs and other substances from key internal finishes and fittings comply with best practice\nlevels."},null,null,null,"1. Färger och lacker har testats mot EN ISO 11890-2:2006 Färg och lack. Bestämning av halt flyktiga komponenter. Gaskromatografisk metod och uppfyller fas II gränsvärden för VOC-innehåll i Annex II i direktivet 2004/42/CE. Alla inomhusfärger i våtrum inomhus ska vara resistenta mot svamp och alger.\n2. Minst fem av de sex produktkategorierna i Tabell 11 (där de är specificerade) har testats och uppfyller relevanta standarder vad gäller halten av flyktiga organiska föreningar (VOC).\n\nKriterier för exemplarisk nivå\nNedan beskrivs de kriterier som ska uppfyllas för en innovationspoäng för denna BREEAM-indikator:\n1. Poängen för Hea 9 ska ha erhållits\n2. Alla produktkategorier nedan (där de är specificerade) har testats och uppfyller relevanta standarder för halter av flyktiga organiska föreningar (VOC). ","One credit where evidence provided demonstrates that the emissions of VOCs and other substances from key internal finishes and fittings comply with best practice\nlevels.",null,1,null,null,null,null,0,null,null,null,{"$f":"IF(OR(islike($V43,\"*2*\"),islike($V43,\"*1B*\")),EY43*0.5,EY43)","v":{"$error":"#NAME?"}},{"$f":"IF(OR(islike($V43,\"*2*\"),islike($V43,\"*1B*\")),EZ43*0.5,EZ43)","v":{"$error":"#NAME?"}},{"$f":"IF(OR(islike($V43,\"*2*\"),islike($V43,\"*1B*\")),FA43*0.5,FA43)","v":{"$error":"#NAME?"}},{"$f":"IF(OR(islike($V43,\"*2*\"),islike($V43,\"*1B*\")),FB43*0.5,FB43)","v":{"$error":"#NAME?"}},{"$f":"IF(OR(islike($V43,\"*2*\"),islike($V43,\"*1B*\")),FC43*0.5,FC43)","v":{"$error":"#NAME?"}},null,null,null,null,1,1,1,1,null,null,null,null,null,null,null,null,1,1,1,1,1,null,null,null,1,null,null,null,null,null,null,null,null,null,null,null,null,null,1,"Y",null,1,null,null,null,null,null,null,null,null,1,"Y",null,1,null,null,1,"Y",null,1,null,null,null,null,null,null,null,1,"Y",null,1,null,null,null,null,null,null,null,null,null,null,null,null,null,null,null,null,null,null,null,1,"Y",null,1,null,null,null,null,null,null,null,null,null,null,1,"Y",null,1,null,null,null,null,null,null,null,null,null,null,null,null,null,null,{"$f":"SUM(EF43:ET43)","v":1},"Y",null,null,0,0,0,0,0]
[null,"Hea 10","Termisk komfort","One credit where evidence provided demonstrates that an analytical measurement and evaluation of the thermal comfort levels of the building has been carried out using the PMV and PPD indices in accordance with EN ISO 7730:2005. Two credits where evidence provided demonstrates that thermal comfort levels in occupied spaces of the building are assessed at the design stage to evaluate appropiate servicing options, ensuring appropiate thermal comfort levels are achieved.",null,"En poäng\n1. En analys och utvärdering av byggnadens termiska komfortnivå med PMV (Predicted Mean Vote) och PPD (Predicted Percentage of Dissatisfied) har utförts enligt SS-EN ISO 7730:2006 Ergonomi för den termiska miljön – analytisk bestämning och bedömning av termisk komfort med hjälp av in-dexen PMV och PPD samt kriterier för lokal termisk komfort.\n2. Kriterierna för termisk komfort har använts för att bestämma byggnadens termiska komfortnivåer, särskilt att inomhustemperaturerna vinter- och sommar ligger i linje med de rekommenderade krite-rierna för komfort i SS-EN ISO 7730:2006 och att inte det termiska klimatet i någon del av byggna-den definieras som lokalt missnöjd.\n3. Nivåerna för termisk komfort i vistelserum uppfyller kraven i kategori B i bilaga A till SS-EN ISO 7730:2006.\n\nTvå poäng \n1. Det termiska klimatet har simulerats för att optimera den termiska komforten.\n2. Simuleringsmodellen används vid beslut av design vad gäller termisk komfort och:\na. Byggnadens form och orientering\nb. Planlösning \nc. Effekter som träd och skuggande byggnader har på solvärmetillskott och värmetransmiss-ionsförluster.\nd. Optimera dagsljuset vilket minskar behovet av belysningsel som ökar kylbehovet och på-verkar den termiska komforten.\ne. Risken för övertemperatur\n\n3. Termisk komfortnivå i vistelserum uppfyller kriterier för lokal termisk komfort, särskilt att temperaturintervallen vinter- och sommar uppfyller de rekommenderade komfortkriterierna.\n4. Beräkning av termisk komfort under projekteringen sker med ett termiskt dynamiskt beräknings-verktyg. För mindre komplexa byggnader kan alternativa beräkningsprogram accepteras.\n\nObservera att dessa två poäng kan erhållas oberoende av varandra.","En poäng\n1. En analys och utvärdering av byggnadens termiska komfortnivå med PMV (Predicted Mean Vote) och PPD (Predicted Percentage of Dissatisfied) har utförts enligt SS-EN ISO 7730:2006 Ergonomi för den termiska miljön – analytisk bestämning och bedömning av termisk komfort med hjälp av in-dexen PMV och PPD samt kriterier för lokal termisk komfort.\n2. Kriterierna för termisk komfort har använts för att bestämma byggnadens termiska komfortnivåer, särskilt att inomhustemperaturerna vinter- och sommar ligger i linje med de rekommenderade krite-rierna för komfort i SS-EN ISO 7730:2006 och att inte det termiska klimatet i någon del av byggnaden definieras som lokalt missnöjd.\n3. Nivåerna för termisk komfort i vistelserum uppfyller kraven i kategori B i bilaga A till SS-EN ISO 7730:2006.\n\nTvå poäng \n1. Det termiska klimatet har simulerats för att optimera  termisk komfort.\n2. Simuleringsmodellen används vid beslut av design vad gäller termisk komfort och:\na. Byggnadens form och orientering\nb. Planlösning \nc. Effekter som träd och skuggande byggnader har på solvärmetillskott och värmetransmissionsförluster.\nd. Optimera dagsljuset vilket minskar behovet av belysningsel som ökar kylbehovet och påverkar den termiska komforten.\ne. Risken för övertemperatur\n\n3. Termisk komfortnivå i vistelserum uppfyller kriterier för lokal termisk komfort, särskilt att temperaturintervallen vinter- och sommar uppfyller de rekommenderade komfortkriterierna.\n4. Beräkning av termisk komfort under projekteringen sker med ett termiskt dynamiskt beräkningsverktyg. För mindre komplexa byggnader kan alternativa beräkningsprogram accepteras.\n\nObservera att dessa två poäng kan erhållas oberoende av varandra.",{"$f":"$D44","v":"One credit where evidence provided demonstrates that an analytical measurement and evaluation of the thermal comfort levels of the building has been carried out using the PMV and PPD indices in accordance with EN ISO 7730:2005. Two credits where evidence provided demonstrates that thermal comfort levels in occupied spaces of the building are assessed at the design stage to evaluate appropiate servicing options, ensuring appropiate thermal comfort levels are achieved."},null,null,null,"En poäng\n1. En analys och utvärdering av byggnadens termiska komfortnivå med PMV (Predicted Mean Vote) och PPD (Predicted Percentage of Dissatisfied) har utförts enligt SS-EN ISO 7730:2006 Ergonomi för den termiska miljön – analytisk bestämning och bedömning av termisk komfort med hjälp av in-dexen PMV och PPD samt kriterier för lokal termisk komfort.\n2. Kriterierna för termisk komfort har använts för att bestämma byggnadens termiska komfortnivåer, särskilt att inomhustemperaturerna vinter- och sommar ligger i linje med de rekommenderade kriterierna för komfort i SS-EN ISO 7730:2006 och att inte det termiska klimatet i någon del av byggna-den definieras som lokalt missnöjd.\n3. Nivåerna för termisk komfort i vistelserum uppfyller kraven i kategori B i bilaga A till SS-EN ISO 7730:2006.\n\nTvå poäng \n1. Det termiska klimatet har simulerats för att optimera den termiska komforten.\n2. Simuleringsmodellen används vid beslut av design vad gäller termisk komfort och:\na. Byggnadens form och orientering\nb. Planlösning \nc. Effekter som träd och skuggande byggnader har på solvärmetillskott och värmetransmiss-ionsförluster.\nd. Optimera dagsljuset vilket minskar behovet av belysningsel som ökar kylbehovet och på-verkar den termiska komforten.\ne. Risken för övertemperatur\n\n3. Termisk komfortnivå i vistelserum uppfyller kriterier för lokal termisk komfort, särskilt att temperaturintervallen vinter- och sommar uppfyller de rekommenderade komfortkriterierna.\n4. Beräkning av termisk komfort under projekteringen sker med ett termiskt dynamiskt beräknings-verktyg. För mindre komplexa byggnader kan alternativa beräkningsprogram accepteras.\n\nObservera att dessa två poäng kan erhållas oberoende av varandra.","One credit where evidence provided demonstrates that an analytical measurement and evaluation of the thermal comfort levels of the building has been carried out using the PMV and PPD indices in accordance with EN ISO 7730:2005. Two credits where evidence provided demonstrates that thermal comfort levels in occupied spaces of the building are assessed at the design stage to evaluate appropiate servicing options, ensuring appropiate thermal comfort levels are achieved.",null,2,null,null,null,null,0,null,null,null,{"$f":"IF(OR(islike($V44,\"*2*\"),islike($V44,\"*1B*\")),EY44*0.5,EY44)","v":{"$error":"#NAME?"}},{"$f":"IF(OR(islike($V44,\"*2*\"),islike($V44,\"*1B*\")),EZ44*0.5,EZ44)","v":{"$error":"#NAME?"}},{"$f":"IF(OR(islike($V44,\"*2*\"),islike($V44,\"*1B*\")),FA44*0.5,FA44)","v":{"$error":"#NAME?"}},{"$f":"IF(OR(islike($V44,\"*2*\"),islike($V44,\"*1B*\")),FB44*0.5,FB44)","v":{"$error":"#NAME?"}},{"$f":"IF(OR(islike($V44,\"*2*\"),islike($V44,\"*1B*\")),FC44*0.5,FC44)","v":{"$error":"#NAME?"}},null,null,null,null,2,2,2,2,null,null,null,null,null,null,null,null,0,2,2,2,2,null,null,null,1,null,null,null,null,null,null,null,null,null,null,null,null,null,1,"Y",null,1,null,null,null,null,null,null,null,null,1,"Y",null,1,null,null,1,"Y",null,1,null,null,null,null,null,null,null,1,"Y",null,1,null,null,null,null,null,null,null,null,null,null,null,null,null,null,null,null,null,null,null,1,{"$f":"IF(DO44>=0.1,\"Y\",\"N\")","v":"Y"},null,1,null,null,null,null,null,null,null,null,null,null,1,"Y",null,null,null,null,null,null,null,{"$f":"IF(INDlargeoffice=\"y\",1,0)","v":0},null,null,null,null,null,null,null,null,0,{"$f":"IF(INDsmalloffice=\"y\",\"N\",IF(EU44>=0.1,\"Y\",\"N\"))","v":"N"},null,null,0,0,0,0,0]
[null,"Hea 11","Termisk zonindelning och brukarkontroll","One credit where evidence provided demonstrates that local occupant control is available for temperature adjustment in each occupied space to reflect differing user demands.",null,"1. Värme- och komfortkylsystem är utformade för zonvis brukarstyrning av temperaturen i alla vistelserum i byggnaden. \n2. Zoner med separat brukarstyrning (inom vistelserum) finns i området inom 7 m från ytterväggarna och i byggnadens centrala zon, mer än 7 m från ytterväggarna. \n","1. Värme- och komfortkylsystem är utformade för zonvis brukarstyrning av temperaturen i alla vistelserum i byggnaden. \n2. Zoner med separat brukarstyrning (inom vistelserum) finns i området inom 7 m från ytterväggarna och i byggnadens centrala zon, mer än 7 m från ytterväggarna. \n",{"$f":"$D45","v":"One credit where evidence provided demonstrates that local occupant control is available for temperature adjustment in each occupied space to reflect differing user demands."},null,null,null,"1. Värme- och komfortkylsystem är utformade för zonvis brukarstyrning av temperaturen i alla vistelserum i byggnaden. \n2. Zoner med separat brukarstyrning (inom vistelserum) finns i området inom 7 m från ytterväggarna och i byggnadens centrala zon, mer än 7 m från ytterväggarna. \n","One credit where evidence provided demonstrates that local occupant control is available for temperature adjustment in each occupied space to reflect differing user demands.",null,1,null,null,null,null,0,null,null,null,{"$f":"IF(OR(islike($V45,\"*2*\"),islike($V45,\"*1B*\")),EY45*0.5,EY45)","v":{"$error":"#NAME?"}},{"$f":"IF(OR(islike($V45,\"*2*\"),islike($V45,\"*1B*\")),EZ45*0.5,EZ45)","v":{"$error":"#NAME?"}},{"$f":"IF(OR(islike($V45,\"*2*\"),islike($V45,\"*1B*\")),FA45*0.5,FA45)","v":{"$error":"#NAME?"}},{"$f":"IF(OR(islike($V45,\"*2*\"),islike($V45,\"*1B*\")),FB45*0.5,FB45)","v":{"$error":"#NAME?"}},{"$f":"IF(OR(islike($V45,\"*2*\"),islike($V45,\"*1B*\")),FC45*0.5,FC45)","v":{"$error":"#NAME?"}},null,null,null,null,0,1,1,1,null,null,null,null,null,null,null,null,0,1,0,1,null,null,null,null,1,null,null,null,null,null,null,null,null,null,null,null,null,null,1,"Y",null,1,null,null,null,null,null,null,null,null,1,"Y",null,1,null,null,1,"Y",null,1,null,null,null,null,null,null,null,1,"Y",null,null,null,null,null,null,null,null,null,null,null,null,null,null,null,null,null,{"$f":"IF(RETofficelarge=\"Y\",1,0)","v":0},null,null,null,0,"N",null,1,null,null,null,null,null,null,null,null,null,null,1,"Y",null,null,null,null,null,null,null,{"$f":"IF(INDlargeoffice=\"y\",1,0)","v":0},null,null,null,null,null,null,null,null,0,"N",null,null,0,0,0,0,0]
[null,"Hea 12","Legionella","One credit where evidence provided demonstrates that the risk of waterborne and airborne legionella contamination has been minimised.",null,"1. Vattensystem i byggnaden är utformade enligt aktuell version av \"Branschregler Säker vatteninstallation\" och gällande BBR.\n2. Där ingen luftbefuktning är specificerad eller där endast ångbefuktning finns.\n","1. Vattensystem i byggnaden är utformade enligt aktuell version av \"Branschregler Säker vatteninstallation\" och gällande BBR.\n2. Där ingen luftbefuktning är specificerad eller där endast ångbefuktning finns.\n","One credit where evidence provided demonstrates that the risk of waterborne and airborne legionella contamination has been minimised.",null,null,null,"1. Vattensystem i byggnaden är utformade enligt aktuell version av \"Branschregler Säker vattenin-stallation\" och gällande BBR.\n2. Där ingen luftbefuktning är specificerad eller där endast ångbefuktning finns.\n","One credit where evidence provided demonstrates that the risk of waterborne and airborne legionella contamination has been minimised.",null,1,null,null,null,null,0,null,null,null,{"$f":"IF(OR(islike($V46,\"*2*\"),islike($V46,\"*1B*\")),EY46*0.5,EY46)","v":{"$error":"#NAME?"}},{"$f":"IF(OR(islike($V46,\"*2*\"),islike($V46,\"*1B*\")),EZ46*0.5,EZ46)","v":{"$error":"#NAME?"}},{"$f":"IF(OR(islike($V46,\"*2*\"),islike($V46,\"*1B*\")),FA46*0.5,FA46)","v":{"$error":"#NAME?"}},{"$f":"IF(OR(islike($V46,\"*2*\"),islike($V46,\"*1B*\")),FB46*0.5,FB46)","v":{"$error":"#NAME?"}},{"$f":"IF(OR(islike($V46,\"*2*\"),islike($V46,\"*1B*\")),FC46*0.5,FC46)","v":{"$error":"#NAME?"}},null,null,null,null,1,1,1,1,null,null,null,null,null,null,null,null,1,1,1,1,1,null,null,null,1,null,null,null,null,null,null,null,null,null,null,null,null,null,1,"Y",null,1,null,null,null,null,null,null,null,null,1,"Y",null,1,null,null,1,"Y",null,1,null,null,null,null,null,null,null,1,"Y",null,1,null,null,null,null,null,null,null,null,null,null,null,null,null,null,null,null,null,null,null,1,"Y",null,1,null,null,null,null,null,null,null,null,null,null,1,"Y",null,1,null,null,null,null,null,null,null,null,null,null,null,null,null,null,1,"Y",null,null,0,0,0,0,0]
[null,"Hea 13","Ljudmiljö",null,null,"En poäng\n1. Alla akustiska parametrar uppfyller ljudklass C enligt SS 25268:2007\n\n2. Före färdigställande ska ljudprovning utföras av en ljudsakkunnig för att säkerställa att kraven uppfylls i alla relevanta utrymmen. Om kraven inte är uppfyllda, ska erforderliga åtgärder genomföras före överlämnandet.\n\nTvå poäng\n1. Alla akustiska parametrar uppfyller ljudklass B enligt SS 25268:2007\n\n2. Före färdigställande ska ljudprovning utföras av en ljudsakkunnig för att säkerställa att kraven upp-fylls i alla relevanta utrymmen. Om kraven inte är uppfyllda, ska erforderliga åtgärder genomföras före överlämnandet. \n","En poäng\n1. Alla akustiska parametrar uppfyller ljudklass C enligt SS 25268:2007\n\n2. Före färdigställande ska ljudprovning utföras av en ljudsakkunnig för att säkerställa att kraven uppfylls i alla relevanta utrymmen. Om kraven inte är uppfyllda, ska erforderliga åtgärder genomföras före överlämnandet.\n\nTvå poäng\n1. Alla akustiska parametrar uppfyller ljudklass B enligt SS 25268:2007\n\n2. Före färdigställande ska ljudprovning utföras av en ljudsakkunnig för att säkerställa att kraven uppfylls i alla relevanta utrymmen. Om kraven inte är uppfyllda, ska erforderliga åtgärder genomföras före överlämnandet. \n","One credit where evidence provided demonstrates that the building achieves adequate indoor ambient noise levels AND Appropriate airborne sound insulation levels between adjacent acoustically sensitive rooms and occupied spaces, sufficient to ensure adequate privacy.\n\nOne credit where evidence provided demonstrates that areas used for speech achieve reverberation times compliant with table 8 of BS8233 1999.",null,null,null,"En poäng\n1. Alla akustiska parametrar uppfyller ljudklass C enligt SS 25268:2007\n\n2. Före färdigställande ska ljudprovning utföras av en ljudsakkunnig för att säkerställa att kraven upp-fylls i alla relevanta utrymmen. Om kraven inte är uppfyllda, ska erforderliga åtgärder genomföras före överlämnandet.\n\nTvå poäng\n1. Alla akustiska parametrar uppfyller ljudklass B enligt SS 25268:2007\n\n2. Före färdigställande ska ljudprovning utföras av en ljudsakkunnig för att säkerställa att kraven upp-fylls i alla relevanta utrymmen. Om kraven inte är uppfyllda, ska erforderliga åtgärder genomföras före överlämnandet. \n","One credit where evidence provided demonstrates that the building achieves appropriate indoor ambient noise levels in offices areas.\n\nIn addition, for fully fitted buildings only: Appropriate airborne sound insulation levels are achieved between acoustically sensitive spaces and occupied spaces, sufficient to ensure adequate privacy.",null,{"$f":"IF(HC=\"y\",AE47,+IF(Ret=\"y\",AG47,+IF(OFF=\"y\",AI47,+IF(TOYOTA=\"y\",AU47,+IF(PRISONS=\"y\",AM47,+IF(SCHOOLS=\"y\",AO47,+IF(FE=\"y\",AQ47,+IF(INDUSTRIAL=\"y\",AS47))))))))","v":2},null,null,null,null,0,null,null,null,{"$f":"IF(OR(islike($V47,\"*2*\"),islike($V47,\"*1B*\")),EY47*0.5,EY47)","v":{"$error":"#NAME?"}},{"$f":"IF(OR(islike($V47,\"*2*\"),islike($V47,\"*1B*\")),EZ47*0.5,EZ47)","v":{"$error":"#NAME?"}},{"$f":"IF(OR(islike($V47,\"*2*\"),islike($V47,\"*1B*\")),FA47*0.5,FA47)","v":{"$error":"#NAME?"}},{"$f":"IF(OR(islike($V47,\"*2*\"),islike($V47,\"*1B*\")),FB47*0.5,FB47)","v":{"$error":"#NAME?"}},{"$f":"IF(OR(islike($V47,\"*2*\"),islike($V47,\"*1B*\")),FC47*0.5,FC47)","v":{"$error":"#NAME?"}},null,null,null,null,0,2,2,2,null,null,null,null,null,null,null,null,0,2,0,1,null,null,null,null,1,null,null,null,null,null,null,null,null,null,null,null,null,null,1,"Y",null,2,null,null,null,null,null,null,null,null,2,"Y",null,1,null,null,1,"Y",null,1,null,null,null,null,null,null,null,1,"Y",null,null,null,null,null,null,null,null,null,null,null,null,null,null,null,null,null,{"$f":"IF(RETofficelarge=\"Y\",1,0)","v":0},null,null,null,0,"N",null,1,null,null,null,null,null,null,null,null,null,null,1,"Y",null,null,null,null,null,null,null,{"$f":"IF(INDlargeoffice=\"y\",1,0)","v":0},null,null,null,null,null,null,null,null,{"$f":"SUM(EF47:ET47)","v":0},"N",null,null,0,0,0,0,0]
[null,"Hea 14","Mindre kontorsutrymme i handel och industri","Up to two credits where evidence provided demonstrates that office space within the development that is less than 500m2 achieves best practice in terms of occupant comfort and control.",null,"Första poängen\n1. För ett handelsprojekt ska tre av följande punkter uppfyllas för minst 80 % av projektets kontors-golvarea:\na. Utblick: enligt kraven i BREEAM-indikator Hea 2\nb. Bländningskontroll: enligt kraven i BREEAM-indikator Hea 3\nc. Belysningszoner och styrning: enligt kraven i BREEAM-indikator Hea 6\nd. Möjlighet till naturlig ventilation: enligt kraven i BREEAM-indikator Hea 7\ne. Termisk zonering: enligt kraven i BREEAM-indikator Hea 11\nf. Ljudmiljö: Två poäng enligt kraven i BREEAM-indikator Hea 13\n2. För ett industriprojekt ska tre av följande punkter uppfyllas för minst 80 % av kontorsgolvarean:\na. Utblick: enligt kraven för kontor i BREEAM-indikator Hea 2\nb. Bländningskontroll: enligt kraven i BREEAM-indikator Hea 3\nc. Belysningszoner och styrning: enligt kraven i BREEAM-indikator Hea 6\nd. Möjlighet till naturlig ventilation: enligt kraven i BREEAM-indikator Hea 7\ne. Luftkvalitet inomhus: enligt kraven i BREEAM-indikator Hea 8\nf. Termisk komfort: enligt kraven i BREEAM-indikator Hea 10\ng. Termisk zonering: enligt kraven i BREEAM-indikator Hea 11\nh. Ljudmiljö: Två poäng enligt kraven i BREEAM-indikator Hea 13\n\n\nAndra poängen\n1. I handelsprojekt ska fyra av de sex punkterna ovan uppnås för minst 80 % av projektets kontors-golvarea.\n2. I industriprojekt ska sex av de åtta punkterna ovan uppnås för minst 80 % av projektets kontors-golvarea.\n\n\nKriterier för exemplarisk nivå\nNedan beskrivs de kriterier som ska vara uppfyllda för att få innovationspoäng för denna BREEAM-indikator. \n1. En innovationspoäng kan erhållas när alla punkter som beskrivs ovan har uppnåtts för minst 80 % av byggnadens kontorsarea.\n","Första poängen\n1. För ett handelsprojekt ska tre av följande punkter uppfyllas för minst 80 % av projektets kontors-golvarea:\na. Utblick: enligt kraven i BREEAM-indikator Hea 2\nb. Bländningskontroll: enligt kraven i BREEAM-indikator Hea 3\nc. Belysningszoner och styrning: enligt kraven i BREEAM-indikator Hea 6\nd. Möjlighet till naturlig ventilation: enligt kraven i BREEAM-indikator Hea 7\ne. Termisk zonering: enligt kraven i BREEAM-indikator Hea 11\nf. Ljudmiljö: Två poäng enligt kraven i BREEAM-indikator Hea 13\n2. För ett industriprojekt ska tre av följande punkter uppfyllas för minst 80 % av kontorsgolvarean:\na. Utblick: enligt kraven för kontor i BREEAM-indikator Hea 2\nb. Bländningskontroll: enligt kraven i BREEAM-indikator Hea 3\nc. Belysningszoner och styrning: enligt kraven i BREEAM-indikator Hea 6\nd. Möjlighet till naturlig ventilation: enligt kraven i BREEAM-indikator Hea 7\ne. Luftkvalitet inomhus: enligt kraven i BREEAM-indikator Hea 8\nf. Termisk komfort: enligt kraven i BREEAM-indikator Hea 10\ng. Termisk zonering: enligt kraven i BREEAM-indikator Hea 11\nh. Ljudmiljö: Två poäng enligt kraven i BREEAM-indikator Hea 13\n\nAndra poängen\n1. I handelsprojekt ska fyra av de sex punkterna ovan uppnås för minst 80 % av projektets kontors-golvarea.\n2. I industriprojekt ska sex av de åtta punkterna ovan uppnås för minst 80 % av projektets kontors-golvarea.\n\nKriterier för exemplarisk nivå - se manual\n",{"$f":"$E48","v":0},null,null,null,"Första poängen\n1. För ett handelsprojekt ska tre av följande punkter uppfyllas för minst 80 % av projektets kontors-golvarea:\na. Utblick: enligt kraven i BREEAM-indikator Hea 2\nb. Bländningskontroll: enligt kraven i BREEAM-indikator Hea 3\nc. Belysningszoner och styrning: enligt kraven i BREEAM-indikator Hea 6\nd. Möjlighet till naturlig ventilation: enligt kraven i BREEAM-indikator Hea 7\ne. Termisk zonering: enligt kraven i BREEAM-indikator Hea 11\nf. Ljudmiljö: Två poäng enligt kraven i BREEAM-indikator Hea 13\n2. För ett industriprojekt ska tre av följande punkter uppfyllas för minst 80 % av kontorsgolvarean:\na. Utblick: enligt kraven för kontor i BREEAM-indikator Hea 2\nb. Bländningskontroll: enligt kraven i BREEAM-indikator Hea 3\nc. Belysningszoner och styrning: enligt kraven i BREEAM-indikator Hea 6\nd. Möjlighet till naturlig ventilation: enligt kraven i BREEAM-indikator Hea 7\ne. Luftkvalitet inomhus: enligt kraven i BREEAM-indikator Hea 8\nf. Termisk komfort: enligt kraven i BREEAM-indikator Hea 10\ng. Termisk zonering: enligt kraven i BREEAM-indikator Hea 11\nh. Ljudmiljö: Två poäng enligt kraven i BREEAM-indikator Hea 13\n\nAndra poängen\n1. I handelsprojekt ska fyra av de sex punkterna ovan uppnås för minst 80 % av projektets kontors-golvarea.\n2. I industriprojekt ska sex av de åtta punkterna ovan uppnås för minst 80 % av projektets kontors-golvarea.\n\nKriterier för exemplarisk nivå - se manual\n",{"$f":"$D48","v":"Up to two credits where evidence provided demonstrates that office space within the development that is less than 500m2 achieves best practice in terms of occupant comfort and control."},null,0,null,null,null,null,0,null,null,null,{"$f":"IF(OR(islike($V48,\"*2*\"),islike($V48,\"*1B*\")),EY48*0.5,EY48)","v":{"$error":"#NAME?"}},{"$f":"IF(OR(islike($V48,\"*2*\"),islike($V48,\"*1B*\")),EZ48*0.5,EZ48)","v":{"$error":"#NAME?"}},{"$f":"IF(OR(islike($V48,\"*2*\"),islike($V48,\"*1B*\")),FA48*0.5,FA48)","v":{"$error":"#NAME?"}},{"$f":"IF(OR(islike($V48,\"*2*\"),islike($V48,\"*1B*\")),FB48*0.5,FB48)","v":{"$error":"#NAME?"}},{"$f":"IF(OR(islike($V48,\"*2*\"),islike($V48,\"*1B*\")),FC48*0.5,FC48)","v":{"$error":"#NAME?"}},null,null,null,null,0,2,0,0,null,null,null,null,null,null,null,null,0,2,0,2,null,null,null,null,null,null,null,null,null,null,null,null,null,null,null,null,null,null,0,"N",null,null,null,null,null,null,null,null,null,null,0,"N",null,0,null,null,0,"N",null,0,null,null,null,null,null,null,null,0,"N",null,null,null,null,null,null,null,null,null,null,null,null,null,null,null,null,{"$f":"IF(RETofficesmall=\"Y\",1,0)","v":0},null,null,null,null,0,"N",null,0,null,null,null,null,null,null,null,null,null,null,0,"N",null,null,null,null,null,null,{"$f":"IF(INDsmalloffice=\"y\",1,0)","v":0},0,null,null,null,null,null,null,null,null,0,"N",null,null,0,0,0,0,0]
[null,"Hea 15","Radon",null,null,"En poäng\nRadonhalten i byggnaden ska inte överstiga 100 Bq/m3 \n\nTvå poäng\nRadonhalten i byggnaden ska inte överstiga 50 Bq/m3 \n","En poäng\nRadonhalten i byggnaden ska inte överstiga 100 Bq/m3 \n\nTvå poäng\nRadonhalten i byggnaden ska inte överstiga 50 Bq/m3 \n",{"$f":"$F54","v":"En poäng\nRadonhalten i byggnaden ska inte överstiga 100 Bq/m3 \n\nTvå poäng\nRadonhalten i byggnaden ska inte överstiga 50 Bq/m3 \n"},null,null,null,"En poäng\nRadonhalten i byggnaden ska inte överstiga 100 Bq/m3 \n\nTvå poäng\nRadonhalten i byggnaden ska inte överstiga 50 Bq/m3 \n","N/A",null,2,null,null,null,null,{"$f":"IF(partnewpartrefurb=\"y\",Q49,0)","v":0},null,null,null,{"$f":"IF(OR(islike($V49,\"*2*\"),islike($V49,\"*1B*\")),EY49*0.5,EY49)","v":{"$error":"#NAME?"}},{"$f":"IF(OR(islike($V49,\"*2*\"),islike($V49,\"*1B*\")),EZ49*0.5,EZ49)","v":{"$error":"#NAME?"}},{"$f":"IF(OR(islike($V49,\"*2*\"),islike($V49,\"*1B*\")),FA49*0.5,FA49)","v":{"$error":"#NAME?"}},{"$f":"IF(OR(islike($V49,\"*2*\"),islike($V49,\"*1B*\")),FB49*0.5,FB49)","v":{"$error":"#NAME?"}},{"$f":"IF(OR(islike($V49,\"*2*\"),islike($V49,\"*1B*\")),FC49*0.5,FC49)","v":{"$error":"#NAME?"}},null,null,null,null,2,2,2,2,null,null,null,null,null,null,null,null,2,2,0,0,2,null,null,null,1,null,null,null,null,null,null,null,null,null,null,null,null,null,1,"Y",null,2,null,null,null,null,null,null,null,null,{"$f":"SUM(BR49:BZ49)","v":2},{"$f":"IF(CA49>=0.1,\"Y\",\"N\")","v":"Y"},null,0,null,null,0,"N",null,0,null,null,null,null,null,null,null,0,"N",null,2,null,null,null,null,null,null,null,null,null,null,null,null,null,null,null,null,null,null,null,2,"Y",null,0,null,null,null,null,null,null,null,null,null,null,0,"N",null,2,null,null,null,null,null,null,null,null,null,null,null,null,null,null,2,"Y",null,null,0,0,0,0,0]
[null,"Hea 16","Drinking Water",null,null,"N/A","N/A","N/A",null,null,null,"N/A","N/A",null,0,null,null,null,null,0,null,null,null,{"$f":"IF(OR(islike($V50,\"*2*\"),islike($V50,\"*1B*\")),EY50*0.5,EY50)","v":{"$error":"#NAME?"}},{"$f":"IF(OR(islike($V50,\"*2*\"),islike($V50,\"*1B*\")),EZ50*0.5,EZ50)","v":{"$error":"#NAME?"}},{"$f":"IF(OR(islike($V50,\"*2*\"),islike($V50,\"*1B*\")),FA50*0.5,FA50)","v":{"$error":"#NAME?"}},{"$f":"IF(OR(islike($V50,\"*2*\"),islike($V50,\"*1B*\")),FB50*0.5,FB50)","v":{"$error":"#NAME?"}},{"$f":"IF(OR(islike($V50,\"*2*\"),islike($V50,\"*1B*\")),FC50*0.5,FC50)","v":{"$error":"#NAME?"}},null,null,null,null,0,0,0,0,null,null,null,null,null,null,null,null,0,0,0,0,null,null,null,null,null,null,null,null,null,null,null,null,null,null,null,null,null,null,0,"N",null,null,null,null,null,null,null,null,null,null,0,"N",null,0,null,null,0,"N",null,0,null,null,null,null,null,null,null,0,"N",null,0,null,null,null,null,null,null,null,null,null,null,null,null,null,null,null,null,null,null,null,0,"N",null,1,null,null,null,null,null,null,null,null,null,null,1,"Y",null,0,null,null,null,null,null,null,null,null,null,null,null,null,null,null,0,"N",null,null,0,0,0,0,0]
[null,"Hea 17","Specification of Laboratory Fume Cupboards",null,null,"N/A","N/A","N/A",null,null,null,"N/A","N/A",null,0,null,null,null,null,0,null,null,null,{"$f":"IF(OR(islike($V51,\"*2*\"),islike($V51,\"*1B*\")),EY51*0.5,EY51)","v":{"$error":"#NAME?"}},{"$f":"IF(OR(islike($V51,\"*2*\"),islike($V51,\"*1B*\")),EZ51*0.5,EZ51)","v":{"$error":"#NAME?"}},{"$f":"IF(OR(islike($V51,\"*2*\"),islike($V51,\"*1B*\")),FA51*0.5,FA51)","v":{"$error":"#NAME?"}},{"$f":"IF(OR(islike($V51,\"*2*\"),islike($V51,\"*1B*\")),FB51*0.5,FB51)","v":{"$error":"#NAME?"}},{"$f":"IF(OR(islike($V51,\"*2*\"),islike($V51,\"*1B*\")),FC51*0.5,FC51)","v":{"$error":"#NAME?"}},null,null,null,null,0,0,0,0,null,null,null,null,null,null,null,null,0,0,0,0,null,null,null,null,null,null,null,null,null,null,null,null,null,null,null,null,null,null,0,"N",null,null,null,null,null,null,null,null,null,null,0,"N",null,0,null,null,{"$f":"SUM(CD51:CF51)","v":0},"N",null,0,null,null,null,null,null,null,null,{"$f":"SUM(CJ51:CQ51)","v":0},"N",null,0,null,null,null,null,null,null,null,null,null,null,null,null,null,null,null,null,null,null,null,0,"N",null,null,null,null,null,null,null,{"$f":"IF(EDUfume=\"y\",1,0)","v":0},null,null,null,null,0,"N",null,0,null,null,null,null,null,null,null,null,null,null,null,null,null,null,0,"N",null,null,0,0,0,0,0]
[null,"Hea 18","Containment level 2 & 3 laboratory areas",null,null,"N/A","N/A","N/A",null,null,null,"N/A","N/A",null,0,null,null,null,null,0,null,null,null,{"$f":"IF(OR(islike($V52,\"*2*\"),islike($V52,\"*1B*\")),EY52*0.5,EY52)","v":{"$error":"#NAME?"}},{"$f":"IF(OR(islike($V52,\"*2*\"),islike($V52,\"*1B*\")),EZ52*0.5,EZ52)","v":{"$error":"#NAME?"}},{"$f":"IF(OR(islike($V52,\"*2*\"),islike($V52,\"*1B*\")),FA52*0.5,FA52)","v":{"$error":"#NAME?"}},{"$f":"IF(OR(islike($V52,\"*2*\"),islike($V52,\"*1B*\")),FB52*0.5,FB52)","v":{"$error":"#NAME?"}},{"$f":"IF(OR(islike($V52,\"*2*\"),islike($V52,\"*1B*\")),FC52*0.5,FC52)","v":{"$error":"#NAME?"}},null,null,null,null,0,0,0,0,null,null,null,null,null,null,null,null,0,0,0,0,null,null,null,null,null,null,null,null,null,null,null,null,null,null,null,null,null,null,0,"N",null,null,null,null,null,null,null,null,null,null,0,"N",null,0,null,null,0,"N",null,0,null,null,null,null,null,null,null,0,"N",null,0,null,null,null,null,null,null,null,null,null,null,null,null,null,null,null,null,null,null,null,0,"N",null,0,null,null,null,null,null,null,null,null,null,null,0,"N",null,0,null,null,null,null,null,null,null,null,null,null,null,null,null,null,0,"N",null,null,0,0,0,0,0]
[null,"Hea 19","Arts in health",null,null,"N/A","N/A",{"$f":"$F53","v":"N/A"},null,null,null,"N/A","N/A",null,0,null,null,null,null,{"$f":"IF(partnewpartrefurb=\"y\",Q53,0)","v":0},null,null,null,{"$f":"IF(OR(islike($V53,\"*2*\"),islike($V53,\"*1B*\")),EY53*0.5,EY53)","v":{"$error":"#NAME?"}},{"$f":"IF(OR(islike($V53,\"*2*\"),islike($V53,\"*1B*\")),EZ53*0.5,EZ53)","v":{"$error":"#NAME?"}},{"$f":"IF(OR(islike($V53,\"*2*\"),islike($V53,\"*1B*\")),FA53*0.5,FA53)","v":{"$error":"#NAME?"}},{"$f":"IF(OR(islike($V53,\"*2*\"),islike($V53,\"*1B*\")),FB53*0.5,FB53)","v":{"$error":"#NAME?"}},{"$f":"IF(OR(islike($V53,\"*2*\"),islike($V53,\"*1B*\")),FC53*0.5,FC53)","v":{"$error":"#NAME?"}},null,null,null,null,0,0,0,0,null,null,null,null,null,null,null,null,0,0,0,0,null,null,null,null,1,null,null,null,null,null,null,null,null,null,null,null,null,null,1,"Y",null,null,null,null,null,null,null,null,null,null,0,"N",null,0,null,null,0,"N",null,0,null,null,null,null,null,null,null,0,"N",null,0,null,null,null,null,null,null,null,null,null,null,null,null,null,null,null,null,null,null,null,0,"N",null,0,null,null,null,null,null,null,null,null,null,null,0,"N",null,0,null,null,null,null,null,null,null,null,null,null,null,null,null,null,0,"N",null,null,0,0,0,0,0]
[null,"Hea 15","Radon",null,null,"En poäng\nRadonhalten i byggnaden ska inte överstiga 100 Bq/m3 \n\nTvå poäng\nRadonhalten i byggnaden ska inte överstiga 50 Bq/m3 \n","En poäng\nRadonhalten i byggnaden ska inte överstiga 100 Bq/m3 \n\nTvå poäng\nRadonhalten i byggnaden ska inte överstiga 50 Bq/m3 \n",null,null,null,null,"En poäng\nRadonhalten i byggnaden ska inte överstiga 100 Bq/m3 \n\nTvå poäng\nRadonhalten i byggnaden ska inte överstiga 50 Bq/m3 \n",null,null,{"$f":"IF(HC=\"y\",AE54,+IF(Ret=\"y\",AG54,+IF(OFF=\"y\",AI54,+IF(TOYOTA=\"y\",AU54,+IF(PRISONS=\"y\",AM54,+IF(SCHOOLS=\"y\",AO54,+IF(FE=\"y\",AQ54,+IF(INDUSTRIAL=\"y\",AS54))))))))","v":0},null,null,null,null,null,null,null,null,{"$f":"IF(OR(islike($V54,\"*2*\"),islike($V54,\"*1B*\")),EY54*0.5,EY54)","v":{"$error":"#NAME?"}},{"$f":"IF(OR(islike($V54,\"*2*\"),islike($V54,\"*1B*\")),EZ54*0.5,EZ54)","v":{"$error":"#NAME?"}},{"$f":"IF(OR(islike($V54,\"*2*\"),islike($V54,\"*1B*\")),FA54*0.5,FA54)","v":{"$error":"#NAME?"}},{"$f":"IF(OR(islike($V54,\"*2*\"),islike($V54,\"*1B*\")),FB54*0.5,FB54)","v":{"$error":"#NAME?"}},{"$f":"IF(OR(islike($V54,\"*2*\"),islike($V54,\"*1B*\")),FC54*0.5,FC54)","v":{"$error":"#NAME?"}},null,null,null,null,0,2,0,2,null,null,null,null,null,null,null,null,{"$f":"IF(EV54=\"y\",AT54,0)","v":0},2,{"$f":"IF(DP54=\"y\",AV54,0)","v":0},null,2,null,null,null,null,null,null,null,null,null,null,null,null,null,null,null,null,null,0,{"$f":"IF(BO54>=0.1,\"Y\",\"N\")","v":"N"},null,0,null,null,null,null,null,null,null,null,0,"N",null,null,null,null,null,null,null,null,null,null,null,null,null,null,null,null,null,null,0,null,null,null,null,null,null,null,null,null,null,null,null,null,null,null,null,null,null,null,0,"N",null,null,null,null,null,null,null,null,null,null,null,null,null,null,null,0,null,null,null,null,null,null,null,null,null,null,null,null,null,null,0,"N",null,null,0,0,0,0,0]
[null,"Energi"]
[null,"Ene 1","Energianvändning","Up to fifteen credits where evidence provided demonstrates an improvement in the energy performance of the buildings's fabric and service based on the percentage improvement in the assessed designs' predicted Building Energy Performance Index (BEPI) over the Current Standards Building Energy Performance Index (CSBEPI), as defined for the local Energy Performance Certificate OR\n\nUp to fifteen credits where there is no operational National energy Calculation Methodology (NCM) in the country of assessment, evidence provided demonstrates an improvement in the energy performance efficiency of the building's fabric and services through the use of a recognised energy Dynamic Simulation Modelling (DSM) software OR\n\nUp to ten credits where there is no National energy Calculation Methodology in the country of assessment, evidence provided demonstrates an improvement in the energy efficiency of the building's fabric and services using Checklist A7 and that the building achieves lower operational related CO2 emissions.",null,"1. Antal poäng baseras på procentuell förbättring av byggnadens beräknade energiprestanda (BEPI), i kWh/m2Atemp enligt BBRs definition, förhållande till nuvarande energiregler (CSBEPI).\n2. Energiprestanda (BEPI), det vill säga levererad energi till byggnaden beräknas enligt Tolkning av bedömningskriterier. Beräkningen genomförs av en energispecialist som ansvarar för att indata är riktiga.\n3. Antal poäng baseras på procentuell förbättring enligt Tabell 13.  Bedömning av byggnader som byggs om och byggs till beskrivs i tolkning av bedömningskriterier.\n\nEnbart kulturhistoriskt värdefulla byggnader \n1. Ytterligare två poäng kan beviljas kulturhistoriskt värdefulla byggnader om en analys genomförs av konsekvenserna av att förbättra byggnadens klimatskal och eventuellt negativa effekter såväl vad gäller byggnadens historiska karaktär som dess klimatskal. Analysen ska utföras/samordnas av en specialist inom byggnadsvård.\n2. I rapporten lämnas rekommendationer om eventuella förbättringar av byggnadens klimatskal som inkluderar beaktande av följande byggnadsdelar med rekommenderade förbättringsförslag:\n• Tak \n• Ytterväggar eller andra klimatavskiljande väggar\n• Grundkonstruktion/Bottenvåning och andra klimatavskiljande konstruktioner\n• Fönster och ytterdörrar\n• Anslutningar av byggnadsdelar till exempel mellan tak och väggar\n• Anslutning av delar av byggnaden med olika åldrar eller byggnadsteknik\n• Installationstekniska system, det vill säga ventilation, värme, kyla, belysning etc. \nOm betydande förbättringar inte är genomförbara, ska orsakerna till detta redovisas i rapporten, med detaljerade beskrivningar som tar upp byggnadsvård och/eller problem med byggnadens konstruktion som resulterat i denna rekommendation.\n3. För kulturhistoriska byggnader ska en energiexpert och specialist inom byggnadsvård samarbeta för att hitta en lösning där hänsyn tas till historiska värden enligt Svenska Kulturarvet SFS 1988:950 och Plan-och Bygglagen SFS 2010:900. Samtidigt ska en effektiv och hållbar framtida energian-vändning säkerställas.\n4. Bedömning genomförd av en specialist inom byggnadsvård ska redovisas i en rapport som beskriver genomförbara förbättringar. Rapporten ska även omfatta en riskbedömning för varje åtgärd som beskriver de eventuella riskerna för negativa effekter på såväl byggnadens klimatskal som på dess historiska eller konstnärliga värde. De presenterade förslagen ska ha en kostnadsbesparande effekt, beräknad till exempel med LCC-analyser för byggnaden.","1. Antal poäng baseras på procentuell förbättring av byggnadens beräknade energiprestanda (BEPI), i kWh/m2Atemp enligt BBRs definition, förhållande till nuvarande energiregler (CSBEPI).\n2. Energiprestanda (BEPI), det vill säga levererad energi till byggnaden beräknas enligt Tolkning av bedömningskriterier. Beräkningen genomförs av en energispecialist som ansvarar för att indata är riktiga.\n3. Antal poäng baseras på procentuell förbättring enligt Tabell 13.  Bedömning av byggnader som byggs om och byggs till beskrivs i Tolkning av bedömningskriterier.\n\nEnbart kulturhistoriskt värdefulla byggnader \n1. Ytterligare två poäng kan beviljas kulturhistoriskt värdefulla byggnader om en analys genomförs av konsekvenserna av att förbättra byggnadens klimatskal och eventuellt negativa effekter såväl vad gäller byggnadens historiska karaktär som dess klimatskal. Analysen ska utföras/samordnas av en specialist inom byggnadsvård.\n2. I rapporten lämnas rekommendationer om eventuella förbättringar av byggnadens klimatskal som inkluderar beaktande av följande byggnadsdelar med rekommenderade förbättringsförslag:\n• Tak \n• Ytterväggar eller andra klimatavskiljande väggar\n• Grundkonstruktion/Bottenvåning och andra klimatavskiljande konstruktioner\n• Fönster och ytterdörrar\n• Anslutningar av byggnadsdelar till exempel mellan tak och väggar\n• Anslutning av delar av byggnaden med olika åldrar eller byggnadsteknik\n• Installationstekniska system, det vill säga ventilation, värme, kyla, belysning etc. \n\nOm betydande förbättringar inte är genomförbara, ska orsakerna till detta redovisas i rapporten, med detaljerade beskrivningar som tar upp byggnadsvård och/eller problem med byggnadens konstruktion som resulterat i denna rekommendation.\n3. För kulturhistoriska byggnader ska en energiexpert och specialist inom byggnadsvård samarbeta för att hitta en lösning där hänsyn tas till historiska värden enligt Svenska Kulturarvet SFS 1988:950 och Plan-och Bygglagen SFS 2010:900. Samtidigt ska en effektiv och hållbar framtida energianvändning säkerställas.\n4. Bedömning genomförd av en specialist inom byggnadsvård ska redovisas i en rapport som beskriver genomförbara förbättringar. Rapporten ska även omfatta en riskbedömning för varje åtgärd som beskriver de eventuella riskerna för negativa effekter på såväl byggnadens klimatskal som på dess historiska eller konstnärliga värde. De presenterade förslagen ska ha en kostnadsbesparande effekt, beräknad till exempel med LCC-analyser för byggnaden.",{"$f":"$E56","v":0},null,null,null,"1. Antal poäng baseras på procentuell förbättring av byggnadens beräknade energiprestanda (BEPI), i kWh/m2Atemp enligt BBRs definition, förhållande till nuvarande energiregler (CSBEPI).\n2. Energiprestanda (BEPI), det vill säga levererad energi till byggnaden beräknas enligt Tolkning av bedömningskriterier. Beräkningen genomförs av en energispecialist som ansvarar för att indata är riktiga.\n3. Antal poäng baseras på procentuell förbättring enligt Tabell 13.  Bedömning av byggnader som byggs om och byggs till beskrivs i Tolkning av bedömningskriterier.\n\nEnbart kulturhistoriskt värdefulla byggnader \n1. Ytterligare två poäng kan beviljas kulturhistoriskt värdefulla byggnader om en analys genomförs av konsekvenserna av att förbättra byggnadens klimatskal och eventuellt negativa effekter såväl vad gäller byggnadens historiska karaktär som dess klimatskal. Analysen ska utföras/samordnas av en specialist inom byggnadsvård.\n2. I rapporten lämnas rekommendationer om eventuella förbättringar av byggnadens klimatskal som inkluderar beaktande av följande byggnadsdelar med rekommenderade förbättringsförslag:\n• Tak \n• Ytterväggar eller andra klimatavskiljande väggar\n• Grundkonstruktion/Bottenvåning och andra klimatavskiljande konstruktioner\n• Fönster och ytterdörrar\n• Anslutningar av byggnadsdelar till exempel mellan tak och väggar\n• Anslutning av delar av byggnaden med olika åldrar eller byggnadsteknik\n• Installationstekniska system, det vill säga ventilation, värme, kyla, belysning etc. \n\nOm betydande förbättringar inte är genomförbara, ska orsakerna till detta redovisas i rapporten, med detaljerade beskrivningar som tar upp byggnadsvård och/eller problem med byggnadens konstruktion som resulterat i denna rekommendation.\n3. För kulturhistoriska byggnader ska en energiexpert och specialist inom byggnadsvård samarbeta för att hitta en lösning där hänsyn tas till historiska värden enligt Svenska Kulturarvet SFS 1988:950 och Plan-och Bygglagen SFS 2010:900. Samtidigt ska en effektiv och hållbar framtida energian-vändning säkerställas.\n4. Bedömning genomförd av en specialist inom byggnadsvård ska redovisas i en rapport som beskriver genomförbara förbättringar. Rapporten ska även omfatta en riskbedömning för varje åtgärd som beskriver de eventuella riskerna för negativa effekter på såväl byggnadens klimatskal som på dess historiska eller konstnärliga värde. De presenterade förslagen ska ha en kostnadsbesparande effekt, beräknad till exempel med LCC-analyser för byggnaden.",{"$f":"$D$56","v":"Up to fifteen credits where evidence provided demonstrates an improvement in the energy performance of the buildings's fabric and service based on the percentage improvement in the assessed designs' predicted Building Energy Performance Index (BEPI) over the Current Standards Building Energy Performance Index (CSBEPI), as defined for the local Energy Performance Certificate OR\n\nUp to fifteen credits where there is no operational National energy Calculation Methodology (NCM) in the country of assessment, evidence provided demonstrates an improvement in the energy performance efficiency of the building's fabric and services through the use of a recognised energy Dynamic Simulation Modelling (DSM) software OR\n\nUp to ten credits where there is no National energy Calculation Methodology in the country of assessment, evidence provided demonstrates an improvement in the energy efficiency of the building's fabric and services using Checklist A7 and that the building achieves lower operational related CO2 emissions."},null,{"$f":"IF(HC=\"y\",AE56,+IF(Ret=\"y\",AG56,+IF(OFF=\"y\",AI56,+IF(TOYOTA=\"y\",AU56,+IF(PRISONS=\"y\",AM56,+IF(SCHOOLS=\"y\",AO56,+IF(FE=\"y\",AQ56,+IF(INDUSTRIAL=\"y\",AS56))))))))","v":13},null,null,null,null,{"$f":"IF(partnewpartrefurb=\"y\",(Q56*$Q$16)+(R56*$R$16),0)","v":0},null,null,null,{"$f":"IF(OR(islike($V56,\"*2*\"),islike($V56,\"*1B*\")),EY56*0.5,EY56)","v":{"$error":"#NAME?"}},{"$f":"IF(OR(islike($V56,\"*2*\"),islike($V56,\"*1B*\")),EZ56*0.5,EZ56)","v":{"$error":"#NAME?"}},{"$f":"IF(OR(islike($V56,\"*2*\"),islike($V56,\"*1B*\")),FA56*0.5,FA56)","v":{"$error":"#NAME?"}},{"$f":"IF(OR(islike($V56,\"*2*\"),islike($V56,\"*1B*\")),FB56*0.5,FB56)","v":{"$error":"#NAME?"}},{"$f":"IF(OR(islike($V56,\"*2*\"),islike($V56,\"*1B*\")),FC56*0.5,FC56)","v":{"$error":"#NAME?"}},null,null,null,null,{"$f":"IF(DP56=\"y\",AH56,0)","v":13},13,{"$f":"IF(CB56=\"y\",AJ56,0)","v":13},13,null,null,null,null,null,null,null,null,13,13,13,13,13,null,null,null,1,null,null,null,null,null,null,null,null,null,null,null,null,null,1,"Y",null,1,null,null,null,null,null,null,null,null,1,"Y",null,1,null,null,1,"Y",null,1,null,null,null,null,null,null,null,1,"Y",null,1,null,null,null,null,null,null,null,null,null,null,null,null,null,null,null,null,null,null,null,{"$f":"SUM(CU56:DN56)","v":1},"Y",null,1,null,null,null,null,null,null,null,null,null,null,1,"Y",null,1,null,null,null,null,null,null,null,null,null,null,null,null,null,null,1,"Y",null,null,0,0,0,5,9]
[null,"Ene 2","Separat mätning av betydande energianvändning","One credit where evidence provided demonstrates the provision of direct sub-metering of energy uses within the building.",null,"1. Separata och tillgängliga undermätare för energi, märkta med slutanvändning av den energi som mäts, finns för följande system (om de finns):\na. Uppvärmning av rum och ventilationsluft\nb. Varmvatten\nc. Luftbefuktning\nd. Komfortkyla\ne. Fläktar och cirkulationspumpar \nf. Belysning\ng. Mindre teknikutrustning (till exempel belysning och elapparater kan finnas på samma separata mätare om det mäts på varje våning/avdelning).\nh. Andra större energikrävande anläggningar om de finns (se Tolkning av bedömningskriterier).\n\nELLER\n2. Styr- och övervakningssystem finns med separat uppföljning och redovisning enligt punkt 1 ovan.\n","1. Separata och tillgängliga undermätare för energi, märkta med slutanvändning av den energi som mäts, finns för följande system (om de finns):\na. Uppvärmning av rum och ventilationsluft\nb. Varmvatten\nc. Luftbefuktning\nd. Komfortkyla\ne. Fläktar och cirkulationspumpar \nf. Belysning\ng. Mindre teknikutrustning (till exempel belysning och elapparater kan finnas på samma separata mätare om det mäts på varje våning/avdelning).\nh. Andra större energikrävande anläggningar om de finns (se Tolkning av bedömningskriterier).\n\nELLER\n2. Styr- och övervakningssystem finns med separat uppföljning och redovisning enligt punkt 1 ovan.",{"$f":"$D57","v":"One credit where evidence provided demonstrates the provision of direct sub-metering of energy uses within the building."},null,null,null,"1. Separata och tillgängliga undermätare för energi, märkta med slutanvändning av den energi som mäts, finns för följande system (om de finns):\na. Uppvärmning av rum och ventilationsluft\nb. Varmvatten\nc. Luftbefuktning\nd. Komfortkyla\ne. Fläktar och cirkulationspumpar \nf. Belysning\ng. Mindre teknikutrustning (till exempel belysning och elapparater kan finnas på samma separata mätare om det mäts på varje våning/avdelning).\nh. Andra större energikrävande anläggningar om de finns (se Tolkning av bedömningskriterier).\n\nELLER\n2. Styr- och övervakningssystem finns med separat uppföljning och redovisning enligt punkt 1 ovan.\n",{"$f":"$D57","v":"One credit where evidence provided demonstrates the provision of direct sub-metering of energy uses within the building."},null,1,null,null,null,null,0,null,null,null,{"$f":"IF(OR(islike($V57,\"*2*\"),islike($V57,\"*1B*\")),EY57*0.5,EY57)","v":{"$error":"#NAME?"}},{"$f":"IF(OR(islike($V57,\"*2*\"),islike($V57,\"*1B*\")),EZ57*0.5,EZ57)","v":{"$error":"#NAME?"}},{"$f":"IF(OR(islike($V57,\"*2*\"),islike($V57,\"*1B*\")),FA57*0.5,FA57)","v":{"$error":"#NAME?"}},{"$f":"IF(OR(islike($V57,\"*2*\"),islike($V57,\"*1B*\")),FB57*0.5,FB57)","v":{"$error":"#NAME?"}},{"$f":"IF(OR(islike($V57,\"*2*\"),islike($V57,\"*1B*\")),FC57*0.5,FC57)","v":{"$error":"#NAME?"}},null,null,null,null,1,1,1,1,null,null,null,null,null,null,null,null,1,1,1,1,1,null,null,null,1,null,null,null,null,null,null,null,null,null,null,null,null,null,1,"Y",null,1,null,null,null,null,null,null,null,null,1,"Y",null,1,null,null,1,"Y",null,1,null,null,null,null,null,null,null,1,"Y",null,1,null,null,null,null,null,null,null,null,null,null,null,null,null,null,null,null,null,null,null,1,"Y",null,1,null,null,null,null,null,null,null,null,null,null,1,"Y",null,1,null,null,null,null,null,null,null,null,null,null,null,null,null,null,1,"Y",null,null,0,0,1,1,1]
[null,"Ene 3","Separat energimätning av hyresgäster eller betydande energianvändare","One credit where evidence provided demonstrates sub-metering of energy consumption by tenancy/building function area is installed within the building.",null,"1. Installation av tillgängliga undermätare för varje hyresgästs energianvändning, eller om det endast finns en hyresgäst - relevanta funktionsområden/avdelningar i byggnaden/enheten. \n2. Undermätarna är märkta med energins slutanvändning.\n","1. Installation av tillgängliga undermätare för varje hyresgästs energianvändning, eller om det endast finns en hyresgäst - relevanta funktionsområden/avdelningar i byggnaden/enheten. \n2. Undermätarna är märkta med energins slutanvändning.\n","N/A",null,null,null,"1. Installation av tillgängliga undermätare för varje hyresgästs energianvändning, eller om det endast finns en hyresgäst - relevanta funktionsområden/avdelningar i byggnaden/enheten. \n2. Undermätarna är märkta med energins slutanvändning.\n",{"$f":"$D58","v":"One credit where evidence provided demonstrates sub-metering of energy consumption by tenancy/building function area is installed within the building."},null,1,null,null,null,null,0,null,null,null,{"$f":"IF(OR(islike($V58,\"*2*\"),islike($V58,\"*1B*\")),EY58*0.5,EY58)","v":{"$error":"#NAME?"}},{"$f":"IF(OR(islike($V58,\"*2*\"),islike($V58,\"*1B*\")),EZ58*0.5,EZ58)","v":{"$error":"#NAME?"}},{"$f":"IF(OR(islike($V58,\"*2*\"),islike($V58,\"*1B*\")),FA58*0.5,FA58)","v":{"$error":"#NAME?"}},{"$f":"IF(OR(islike($V58,\"*2*\"),islike($V58,\"*1B*\")),FB58*0.5,FB58)","v":{"$error":"#NAME?"}},{"$f":"IF(OR(islike($V58,\"*2*\"),islike($V58,\"*1B*\")),FC58*0.5,FC58)","v":{"$error":"#NAME?"}},null,null,null,null,1,1,1,1,null,null,null,null,null,null,null,null,1,1,1,1,1,null,null,null,1,null,null,null,null,null,null,null,null,null,null,null,null,null,1,"Y",null,1,null,null,null,null,null,null,null,null,1,"Y",null,0,null,null,0,"N",null,0,null,null,null,null,null,null,null,0,"N",null,1,null,null,null,null,null,null,null,null,null,null,null,null,null,null,null,null,null,null,null,1,"Y",null,null,null,{"$f":"IF(EDUFE=\"y\",1,0)","v":0},null,{"$f":"IF(SCHsecondary=\"y\",1,0)","v":0},null,null,null,null,null,null,0,"N",null,1,null,null,null,null,null,null,null,null,null,null,null,null,null,null,1,"Y",null,null,0,0,0,0,0]
[null,"Ene 4","Utomhusbelysning","One credit where energy-efficient external lighting is specified and all light fittings are controlled for the presence of daylight.",null,"Följande krav ska vara uppfyllda (där belysning finns):\n1. All utvändig belysning för byggnader, tillfartsvägar och vägar har ett ljusutbyte på minst 50 lumen/Watt för lampor med färgåtergivningsindex (Ra) större än eller lika med 60. ELLER 60 lm/W för lampor med färgåtergivningsindex mindre än 60.\n2. All belysning för parkeringsytor, tillhörande vägar och strålkastare har ett ljusutbyte på minst 70 lm/W för lampor med färgåtergivningsindex (Ra) större än eller lika med 60. ELLER 80 lm/W för lampor med färgåtergivningsindex mindre än 60.\n3. All belysning utomhus för skyltar och uppljus har ett ljusutbyte på minst 60 lm/W då lampans effekt är högre än eller lika med 25 W. ELLER 50 lumen/Watt när lampans effekt är lägre än 25 W.\n4. Belysning utomhus styrs via timer eller regleras med dagsljussensor som hindrar att den är tänd dagtid. Det accepteras att manuell belysningsstyrning styr över dagsljussensor .","Följande krav ska vara uppfyllda (där belysning finns):\n1. All utvändig belysning för byggnader, tillfartsvägar och vägar har ett ljusutbyte på minst 50 lu-men/Watt för lampor med färgåtergivningsindex (Ra) större än eller lika med 60. ELLER 60 lm/W för lampor med färgåtergivningsindex mindre än 60.\n2. All belysning för parkeringsytor, tillhörande vägar och strålkastare har ett ljusutbyte på minst 70 lm/W för lampor med färgåtergivningsindex (Ra) större än eller lika med 60. ELLER 80 lm/W för lampor med färgåtergivningsindex mindre än 60.\n3. All belysning utomhus för skyltar och uppljus har ett ljusutbyte på minst 60 lm/W då lampans effekt är högre än eller lika med 25 W. ELLER 50 lumen/Watt när lampans effekt är lägre än 25 W.\n4. Belysning utomhus styrs via timer eller regleras med dagsljussensor som hindrar att den är tänd dagtid. Det accepteras att manuell belysningsstyrning styr över dagsljussensor.\n",{"$f":"$D59","v":"One credit where energy-efficient external lighting is specified and all light fittings are controlled for the presence of daylight."},null,null,null,"Följande krav ska vara uppfyllda (där belysning finns):\n1. All utvändig belysning för byggnader, tillfartsvägar och vägar har ett ljusutbyte på minst 50 lu-men/Watt för lampor med färgåtergivningsindex (Ra) större än eller lika med 60. ELLER 60 lm/W för lampor med färgåtergivningsindex mindre än 60.\n2. All belysning för parkeringsytor, tillhörande vägar och strålkastare har ett ljusutbyte på minst 70 lm/W för lampor med färgåtergivningsindex (Ra) större än eller lika med 60. ELLER 80 lm/W för lampor med färgåtergivningsindex mindre än 60.\n3. All belysning utomhus för skyltar och uppljus har ett ljusutbyte på minst 60 lm/W då lampans effekt är högre än eller lika med 25 W. ELLER 50 lumen/Watt när lampans effekt är lägre än 25 W.\n4. Belysning utomhus styrs via timer eller regleras med dagsljussensor som hindrar att den är tänd dagtid. Det accepteras att manuell belysningsstyrning styr över dagsljussensor .\n",{"$f":"$D59","v":"One credit where energy-efficient external lighting is specified and all light fittings are controlled for the presence of daylight."},null,1,null,null,null,null,0,null,null,null,{"$f":"IF(OR(islike($V59,\"*2*\"),islike($V59,\"*1B*\")),EY59*0.5,EY59)","v":{"$error":"#NAME?"}},{"$f":"IF(OR(islike($V59,\"*2*\"),islike($V59,\"*1B*\")),EZ59*0.5,EZ59)","v":{"$error":"#NAME?"}},{"$f":"IF(OR(islike($V59,\"*2*\"),islike($V59,\"*1B*\")),FA59*0.5,FA59)","v":{"$error":"#NAME?"}},{"$f":"IF(OR(islike($V59,\"*2*\"),islike($V59,\"*1B*\")),FB59*0.5,FB59)","v":{"$error":"#NAME?"}},{"$f":"IF(OR(islike($V59,\"*2*\"),islike($V59,\"*1B*\")),FC59*0.5,FC59)","v":{"$error":"#NAME?"}},null,null,null,null,1,1,1,1,null,null,null,null,null,null,null,null,1,1,1,1,1,null,null,null,1,null,null,null,null,null,null,null,null,null,null,null,null,null,1,"Y",null,1,null,null,null,null,null,null,null,null,1,"Y",null,1,null,null,1,"Y",null,1,null,null,null,null,null,null,null,1,"Y",null,1,null,null,null,null,null,null,null,null,null,null,null,null,null,null,null,null,null,null,null,1,"Y",null,1,null,null,null,null,null,null,null,null,null,null,1,"Y",null,1,null,null,null,null,null,null,null,null,null,null,null,null,null,null,1,"Y",null,null,0,0,0,0,0]
[null,"Ene 5","Energiförsörjning med låga koldioxidutsläpp","One credit where evidence provided demonstrates that a feasibility study considering local (on-site and/or near site) low or zero carbon (LZC) technologies has been carried out and the results implemented.\n\nTwo credits where evidence provided demonstrates that the first credit has been achieved and there is a 10% reduction in the building’s CO2 emissions as a result of the installation of a feasible local LZC technology.\n\nThree credits where evidence provided demonstrates that the first credit has been achieved and there is a 15% reduction in the building’s CO2 emissions as a result of the installation of a feasible local LZC technology.\n\nOr alternatively:\n\nA maximum of one credit where evidence provided demonstrates that a contract with an energy supplier is in place to provide sufficient electricity used within the assessed building/development to meet the above criteria from a 100% renewable energy source. (Note: a standard Green Tariff will not comply)",null,"Första poängen \n1. En energispecialist har genomfört en förstudie (se Tolkning av bedömningskriterier) för att komma fram till den bästa lokala LZC-energikällan för byggnaden/projektet, på eller nära tomten. Förstu-dien omfattar minst:\na. Energi som genereras från LZC-energikällor per år och tillhörande utsläpp av koldioxid\nb. Pay-back\nc. Markanvändning \nd. Lokala planeringskriterier \ne. Buller \nf. Möjligheterna till exporter av värme/el \ng. Livscykelkostnad eller livscykelpåverkan från möjliga tekniker vad avser koldioxidutsläpp\nh. Alla tillgängliga stöd eller bidrag\ni. Värdering av alla tekniker som är lämpliga i förhållande till lokaliseringen och till projektets efterfrågan på energi. \nj. Skäl för uteslutning av andra tekniker. \nk. Konsekvenser av anslutning till eventuell befintlig fjärrvärme och fjärrkyla \n\n2. En lokal LZC-teknik för energi har specificerats för byggnaden/projektet enligt rekommendationerna i förstudien. \n3. Förstudien är genomförd under ”concept design stage”.\n\nELLER\n4. Organisationen som ska använda byggnaden har avtal med energileverantör om leverans av el till byggnaden/projektet från en 100 % förnybar energikälla. Elen ska komma från en ackrediterad ex-tern förnybar källa. Avtalet ska vara giltigt i minst 3 år från det datum då den bedömda byggnaden tas i bruk.\n\nAndra poängen\n1. Första poängen är uppnådd.\n2. Lokal LZC-teknik installeras som följer rekommendationerna i förstudien och som minskar byggna-dens årliga CO2-utsläpp med 10 %. Beräkning av procentuell minskning beskrivs i Tolkning av be-dömningskriterier nedan.\n3. Siffror som används vid beräkning av procentuell reduktion av koldioxidutsläpp på grund av LZC-teknik, baseras på resultat från erkänt energiberäkningsprogram.\n\nTredje poängen\n1. Första poängen är uppnådd.\n2. Lokal LZC-teknik installeras som följer rekommendationerna i förstudien och som minskar byggna-dens årliga CO2-utsläpp med 15 %. Beräkning av procentuell reduktion beskrivs i Tolkning av be-dömningskriterier nedan.\n3. Siffror som används vid beräkning av procentuell minskning av koldioxidutsläpp på grund av LZC-teknik, baseras på resultat från erkänt energiberäkningsprogram.\n\n\nKriterier för exemplarisk nivå\nNedan beskrivs kriterierna för de tre innovationspoäng som finns tillgängliga i denna BREEAM-indikator. \n\nEn innovationspoäng\n1. Första poängen är uppnådd.\n2. Lokal LZC-teknik installeras som följer rekommendationerna i förstudien och minskar byggnadens årliga CO2-utsläpp med 50 %. Beräkning av procentuell minskning beskrivs i Tolkning av bedöm-ningskriterier nedan.\n3. Siffror som används vid beräkning av procentuell reduktion av koldioxidutsläpp på grund av LZC-teknik, baseras på resultat från erkänt energiberäkningsprogram.\n\nTvå innovationspoäng\n1. Första poängen är uppnådd.\n2. Lokal LZC-teknik installeras som följer rekommendationerna i förstudien och minskar byggnadens årliga CO2-utsläpp med 100 %. Beräkning av procentuell reduktion beskrivs i Tolkning av bedöm-ningskriterier nedan.\n3. Siffror som används vid beräkning av procentuell minskning av koldioxidutsläpp på grund av LZC-teknik, baseras på resultat från erkänt energiberäkningsprogram.\n\nTre innovationspoäng\n1. Installation av LZC-teknik, som minskar CO2-utsläppen med 100 % vad avser all energi till bygg-naden, det vill säga som resulterar i en byggnad utan koldioxidutsläpp. Med all energi avses energi till både fastighet och verksamhet. \n2. Siffror som används vid beräkning av procentuell reduktion av koldioxidutsläpp på grund av LZC-teknik, baseras på resultat från erkänt energiberäkningsprogram.\n\nByggnader som uppfyller kriterierna för exemplarisk nivå kan således erhålla sex poäng i denna indika-tor.","Första poängen \n1. En energispecialist har genomfört en förstudie (se Tolkning av bedömningskriterier) för att komma fram till den bästa lokala LZC-energikällan för byggnaden/projektet, på eller nära tomten. Förstu-dien omfattar minst:\na. Energi som genereras från LZC-energikällor per år och tillhörande utsläpp av koldioxid\nb. Pay-back\nc. Markanvändning \nd. Lokala planeringskriterier \ne. Buller \nf. Möjligheterna till exporter av värme/el \ng. Livscykelkostnad eller livscykelpåverkan från möjliga tekniker vad avser koldioxidutsläpp\nh. Alla tillgängliga stöd eller bidrag\ni. Värdering av alla tekniker som är lämpliga i förhållande till lokaliseringen och till projektets efterfrågan på energi. \nj. Skäl för uteslutning av andra tekniker. \nk. Konsekvenser av anslutning till eventuell befintlig fjärrvärme och fjärrkyla \n\n2. En lokal LZC-teknik för energi har specificerats för byggnaden/projektet enligt rekommendationerna i förstudien. \n3. Förstudien är genomförd under ”concept design stage”.\n\nELLER\n4. Organisationen som ska använda byggnaden har avtal med energileverantör om leverans av el till byggnaden/projektet från en 100 % förnybar energikälla. Elen ska komma från en ackrediterad ex-tern förnybar källa. Avtalet ska vara giltigt i minst 3 år från det datum då den bedömda byggnaden tas i bruk.\n\nAndra poängen\n1. Första poängen är uppnådd.\n2. Lokal LZC-teknik installeras som följer rekommendationerna i förstudien och som minskar byggna-dens årliga CO2-utsläpp med 10 %. Beräkning av procentuell minskning beskrivs i Tolkning av bedömningskriterier nedan.\n3. Siffror som används vid beräkning av procentuell reduktion av koldioxidutsläpp på grund av LZC-teknik, baseras på resultat från erkänt energiberäkningsprogram.\n\nTredje poängen\n1. Första poängen är uppnådd.\n2. Lokal LZC-teknik installeras som följer rekommendationerna i förstudien och som minskar byggna-dens årliga CO2-utsläpp med 15 %. Beräkning av procentuell reduktion beskrivs i Tolkning av be-dömningskriterier nedan.\n3. Siffror som används vid beräkning av procentuell minskning av koldioxidutsläpp på grund av LZC-teknik, baseras på resultat från erkänt energiberäkningsprogram.\n\nKriterier för exemplarisk nivå\nNedan beskrivs kriterierna för de tre innovationspoäng som finns tillgängliga i denna BREEAM-indikator. \n\nEn innovationspoäng\n1. Första poängen är uppnådd.\n2. Lokal LZC-teknik installeras som följer rekommendationerna i förstudien och minskar byggnadens årliga CO2-utsläpp med 50 %. Beräkning av procentuell minskning beskrivs i Tolkning av bedöm-ningskriterier nedan.\n3. Siffror som används vid beräkning av procentuell reduktion av koldioxidutsläpp på grund av LZC-teknik, baseras på resultat från erkänt energiberäkningsprogram.\n\nTvå innovationspoäng\n1. Första poängen är uppnådd.\n2. Lokal LZC-teknik installeras som följer rekommendationerna i förstudien och minskar byggnadens årliga CO2-utsläpp med 100 %. Beräkning av procentuell reduktion beskrivs i Tolkning av bedöm-ningskriterier nedan.\n3. Siffror som används vid beräkning av procentuell minskning av koldioxidutsläpp på grund av LZC-teknik, baseras på resultat från erkänt energiberäkningsprogram.\n\nTre innovationspoäng\n1. Installation av LZC-teknik, som minskar CO2-utsläppen med 100 % vad avser all energi till bygg-naden, det vill säga som resulterar i en byggnad utan koldioxidutsläpp. Med all energi avses energi till både fastighet och verksamhet. \n2. Siffror som används vid beräkning av procentuell reduktion av koldioxidutsläpp på grund av LZC-teknik, baseras på resultat från erkänt energiberäkningsprogram.\n\nByggnader som uppfyller kriterierna för exemplarisk nivå kan således erhålla sex poäng i denna indikator.",{"$f":"$D60","v":"One credit where evidence provided demonstrates that a feasibility study considering local (on-site and/or near site) low or zero carbon (LZC) technologies has been carried out and the results implemented.\n\nTwo credits where evidence provided demonstrates that the first credit has been achieved and there is a 10% reduction in the building’s CO2 emissions as a result of the installation of a feasible local LZC technology.\n\nThree credits where evidence provided demonstrates that the first credit has been achieved and there is a 15% reduction in the building’s CO2 emissions as a result of the installation of a feasible local LZC technology.\n\nOr alternatively:\n\nA maximum of one credit where evidence provided demonstrates that a contract with an energy supplier is in place to provide sufficient electricity used within the assessed building/development to meet the above criteria from a 100% renewable energy source. (Note: a standard Green Tariff will not comply)"},null,null,null,"Första poängen \n1. En energispecialist har genomfört en förstudie (se Tolkning av bedömningskriterier) för att komma fram till den bästa lokala LZC-energikällan för byggnaden/projektet, på eller nära tomten. Förstu-dien omfattar minst:\na. Energi som genereras från LZC-energikällor per år och tillhörande utsläpp av koldioxid\nb. Pay-back\nc. Markanvändning \nd. Lokala planeringskriterier \ne. Buller \nf. Möjligheterna till exporter av värme/el \ng. Livscykelkostnad eller livscykelpåverkan från möjliga tekniker vad avser koldioxidutsläpp\nh. Alla tillgängliga stöd eller bidrag\ni. Värdering av alla tekniker som är lämpliga i förhållande till lokaliseringen och till projektets efterfrågan på energi. \nj. Skäl för uteslutning av andra tekniker. \nk. Konsekvenser av anslutning till eventuell befintlig fjärrvärme och fjärrkyla \n\n2. En lokal LZC-teknik för energi har specificerats för byggnaden/projektet enligt rekommendationerna i förstudien. \n3. Förstudien är genomförd under ”concept design stage”.\n\nELLER\n4. Organisationen som ska använda byggnaden har avtal med energileverantör om leverans av el till byggnaden/projektet från en 100 % förnybar energikälla. Elen ska komma från en ackrediterad ex-tern förnybar källa. Avtalet ska vara giltigt i minst 3 år från det datum då den bedömda byggnaden tas i bruk.\n\nAndra poängen\n1. Första poängen är uppnådd.\n2. Lokal LZC-teknik installeras som följer rekommendationerna i förstudien och som minskar byggna-dens årliga CO2-utsläpp med 10 %. Beräkning av procentuell minskning beskrivs i Tolkning av be-dömningskriterier nedan.\n3. Siffror som används vid beräkning av procentuell reduktion av koldioxidutsläpp på grund av LZC-teknik, baseras på resultat från erkänt energiberäkningsprogram.\n\nTredje poängen\n1. Första poängen är uppnådd.\n2. Lokal LZC-teknik installeras som följer rekommendationerna i förstudien och som minskar byggna-dens årliga CO2-utsläpp med 15 %. Beräkning av procentuell reduktion beskrivs i Tolkning av be-dömningskriterier nedan.\n3. Siffror som används vid beräkning av procentuell minskning av koldioxidutsläpp på grund av LZC-teknik, baseras på resultat från erkänt energiberäkningsprogram.\n\nKriterier för exemplarisk nivå\nNedan beskrivs kriterierna för de tre innovationspoäng som finns tillgängliga i denna BREEAM-indikator. \n\nEn innovationspoäng\n1. Första poängen är uppnådd.\n2. Lokal LZC-teknik installeras som följer rekommendationerna i förstudien och minskar byggnadens årliga CO2-utsläpp med 50 %. Beräkning av procentuell minskning beskrivs i Tolkning av bedöm-ningskriterier nedan.\n3. Siffror som används vid beräkning av procentuell reduktion av koldioxidutsläpp på grund av LZC-teknik, baseras på resultat från erkänt energiberäkningsprogram.\n\nTvå innovationspoäng\n1. Första poängen är uppnådd.\n2. Lokal LZC-teknik installeras som följer rekommendationerna i förstudien och minskar byggnadens årliga CO2-utsläpp med 100 %. Beräkning av procentuell reduktion beskrivs i Tolkning av bedöm-ningskriterier nedan.\n3. Siffror som används vid beräkning av procentuell minskning av koldioxidutsläpp på grund av LZC-teknik, baseras på resultat från erkänt energiberäkningsprogram.\n\nTre innovationspoäng\n1. Installation av LZC-teknik, som minskar CO2-utsläppen med 100 % vad avser all energi till byggnaden, det vill säga som resulterar i en byggnad utan koldioxidutsläpp. Med all energi avses energi till både fastighet och verksamhet. \n2. Siffror som används vid beräkning av procentuell reduktion av koldioxidutsläpp på grund av LZC-teknik, baseras på resultat från erkänt energiberäkningsprogram.\n\nByggnader som uppfyller kriterierna för exemplarisk nivå kan således erhålla sex poäng i denna indikator.",{"$f":"$D60","v":"One credit where evidence provided demonstrates that a feasibility study considering local (on-site and/or near site) low or zero carbon (LZC) technologies has been carried out and the results implemented.\n\nTwo credits where evidence provided demonstrates that the first credit has been achieved and there is a 10% reduction in the building’s CO2 emissions as a result of the installation of a feasible local LZC technology.\n\nThree credits where evidence provided demonstrates that the first credit has been achieved and there is a 15% reduction in the building’s CO2 emissions as a result of the installation of a feasible local LZC technology.\n\nOr alternatively:\n\nA maximum of one credit where evidence provided demonstrates that a contract with an energy supplier is in place to provide sufficient electricity used within the assessed building/development to meet the above criteria from a 100% renewable energy source. (Note: a standard Green Tariff will not comply)"},null,3,null,null,null,null,{"$f":"IF(partnewpartrefurb=\"y\",Q60,0)","v":0},null,null,null,{"$f":"IF(OR(islike($V60,\"*2*\"),islike($V60,\"*1B*\")),EY60*0.5,EY60)","v":{"$error":"#NAME?"}},{"$f":"IF(OR(islike($V60,\"*2*\"),islike($V60,\"*1B*\")),EZ60*0.5,EZ60)","v":{"$error":"#NAME?"}},{"$f":"IF(OR(islike($V60,\"*2*\"),islike($V60,\"*1B*\")),FA60*0.5,FA60)","v":{"$error":"#NAME?"}},{"$f":"IF(OR(islike($V60,\"*2*\"),islike($V60,\"*1B*\")),FB60*0.5,FB60)","v":{"$error":"#NAME?"}},{"$f":"IF(OR(islike($V60,\"*2*\"),islike($V60,\"*1B*\")),FC60*0.5,FC60)","v":{"$error":"#NAME?"}},null,null,null,null,3,3,3,3,null,null,null,null,null,null,null,null,3,3,3,3,3,null,null,null,1,null,null,null,null,null,null,null,null,null,null,null,null,null,1,"Y",null,1,null,null,null,null,null,null,null,null,{"$f":"SUM(BR60:BZ60)","v":1},{"$f":"IF(CA60>=0.1,\"Y\",\"N\")","v":"Y"},null,1,null,null,1,"Y",null,1,null,null,null,null,null,null,null,1,"Y",null,1,null,null,null,null,null,null,null,null,null,null,null,null,null,null,null,null,null,null,null,1,"Y",null,1,null,null,null,null,null,null,null,null,null,null,1,"Y",null,1,null,null,null,null,null,null,null,null,null,null,null,null,null,null,1,"Y",null,null,0,0,0,1,1]
[null,"Ene 6","Klimatskalets energiprestanda och lufttäthet","One credit where evidence provided demonstrates that appropriate design and as built performance measures (as identified in the compliance requirements) are taken to minimise heat loss and air infiltration through the building fabric.",null,"Designåtgärder \nI byggnader med lager/verksamhetsområde och/eller utrymme/lastbrygga för varuleverans med fordon har alla designåtgärder nedan specificerats eller installerats för att minimera värmeförluster och luft-läckage genom klimatskärmen i behandlade/klimatiserade utrymmen:\n\n1. Område för lastning/lossning av varor och/eller för lager, där det är relevant är avskilda från varandra. (se även Tolkning av bedömningskriterier).\n2. Alla eventuella portar eller dörröppningar för varor och personal, ventilatorer i tak och kallrasskydd på fläktar är tätade mot luftdrag.\n3. Plastridåer finns mellan interna leveransområden och andra interna lager-/verksamhetsområden (som inte är täta mot drag eller dörrar saknas). Plastridåer ska delvis överlappa varandra. \n4. Ett av följande specificeras för externa öppningar för varuleverans/lastbryggor \na. Plastridåer i plast (med delvis överlappning)\nb. Luftridåer (inte dörrvärmare) som täcker hela öppningen\nc. Pneumatisk tätning av dockningsstationer vid alla lastbryggor\n5. Vid lastbryggor specificeras snabbstängande portar, det vill säga stängningshastigheten är minst 1 m/s eller så är tiden från helt öppen till helt stängd port kortare än 5 s. \n\nPrestandamätning i färdig byggnad\n1. Utöver ovanstående tryckprovas klimatskalets lufttäthet enligt SS-EN 13829. Luftläckaget får vara högst 0,4 l/s,Aomm2, vid 50 Pa. Aom är byggnadens omslutningsyta enligt definition i BBR. \n\nFör att upptäcka eventuellt oönskat luftläckage genom klimatskalet, oönskade köldbryggor och brister i värmeisolering, genomförs en omfattande termografering av byggnadens klimatskal enligt SS-EN 13187. \n2. Eventuella identifierade brister rättas till och därefter genomförs en efterkontroll för att bekräfta att kriterierna är uppfyllda. \n3. Om integrerade fryslager finns, ska dessa testats och tas i drift enligt kriterierna för kylförvaring i BREEAM-indikator Man 1 (detta betyder inte att poäng i BREEAM-indikator Man 1 har erhållits).","Designåtgärder \nI byggnader med lager/verksamhetsområde och/eller utrymme/lastbrygga för varuleverans med fordon har alla designåtgärder nedan specificerats eller installerats för att minimera värmeförluster och luft-läckage genom klimatskärmen i behandlade/klimatiserade utrymmen:\n\n1. Område för lastning/lossning av varor och/eller för lager, där det är relevant är avskilda från varandra. (se även Tolkning av bedömningskriterier).\n2. Alla eventuella portar eller dörröppningar för varor och personal, ventilatorer i tak och kallrasskydd på fläktar är tätade mot luftdrag.\n3. Plastridåer finns mellan interna leveransområden och andra interna lager-/verksamhetsområden (som inte är täta mot drag eller dörrar saknas). Plastridåer ska delvis överlappa varandra. \n4. Ett av följande specificeras för externa öppningar för varuleverans/lastbryggor \na. Plastridåer i plast (med delvis överlappning)\nb. Luftridåer (inte dörrvärmare) som täcker hela öppningen\nc. Pneumatisk tätning av dockningsstationer vid alla lastbryggor\n5. Vid lastbryggor specificeras snabbstängande portar, det vill säga stängningshastigheten är minst 1 m/s eller så är tiden från helt öppen till helt stängd port kortare än 5 s. \n\nPrestandamätning i färdig byggnad\n1. Utöver ovanstående tryckprovas klimatskalets lufttäthet enligt SS-EN 13829. Luftläckaget får vara högst 0,4 l/s,Aomm2, vid 50 Pa. Aom är byggnadens omslutningsyta enligt definition i BBR. \n\nFör att upptäcka eventuellt oönskat luftläckage genom klimatskalet, oönskade köldbryggor och brister i värmeisolering, genomförs en omfattande termografering av byggnadens klimatskal enligt SS-EN 13187. \n2. Eventuella identifierade brister rättas till och därefter genomförs en efterkontroll för att bekräfta att kriterierna är uppfyllda. \n3. Om integrerade fryslager finns, ska dessa testats och tas i drift enligt kriterierna för kylförvaring i BREEAM-indikator Man 1 (detta betyder inte att poäng i BREEAM-indikator Man 1 har erhållits).",{"$f":"$E61","v":0},null,null,null,"Designåtgärder \nI byggnader med lager/verksamhetsområde och/eller utrymme/lastbrygga för varuleverans med fordon har alla designåtgärder nedan specificerats eller installerats för att minimera värmeförluster och luft-läckage genom klimatskärmen i behandlade/klimatiserade utrymmen:\n\n1. Område för lastning/lossning av varor och/eller för lager, där det är relevant är avskilda från varandra. (se även Tolkning av bedömningskriterier).\n2. Alla eventuella portar eller dörröppningar för varor och personal, ventilatorer i tak och kallrasskydd på fläktar är tätade mot luftdrag.\n3. Plastridåer finns mellan interna leveransområden och andra interna lager-/verksamhetsområden (som inte är täta mot drag eller dörrar saknas). Plastridåer ska delvis överlappa varandra. \n4. Ett av följande specificeras för externa öppningar för varuleverans/lastbryggor \na. Plastridåer i plast (med delvis överlappning)\nb. Luftridåer (inte dörrvärmare) som täcker hela öppningen\nc. Pneumatisk tätning av dockningsstationer vid alla lastbryggor\n5. Vid lastbryggor specificeras snabbstängande portar, det vill säga stängningshastigheten är minst 1 m/s eller så är tiden från helt öppen till helt stängd port kortare än 5 s. \n\nPrestandamätning i färdig byggnad\n1. Utöver ovanstående tryckprovas klimatskalets lufttäthet enligt SS-EN 13829. Luftläckaget får vara högst 0,4 l/s,Aomm2, vid 50 Pa. Aom är byggnadens omslutningsyta enligt definition i BBR. \n\nFör att upptäcka eventuellt oönskat luftläckage genom klimatskalet, oönskade köldbryggor och brister i värmeisolering, genomförs en omfattande termografering av byggnadens klimatskal enligt SS-EN 13187. \n2. Eventuella identifierade brister rättas till och därefter genomförs en efterkontroll för att bekräfta att kriterierna är uppfyllda. \n3. Om integrerade fryslager finns, ska dessa testats och tas i drift enligt kriterierna för kylförvaring i BREEAM-indikator Man 1 (detta betyder inte att poäng i BREEAM-indikator Man 1 har erhållits).",{"$f":"$D61","v":"One credit where evidence provided demonstrates that appropriate design and as built performance measures (as identified in the compliance requirements) are taken to minimise heat loss and air infiltration through the building fabric."},null,1,null,null,null,null,0,null,null,null,{"$f":"IF(OR(islike($V61,\"*2*\"),islike($V61,\"*1B*\")),EY61*0.5,EY61)","v":{"$error":"#NAME?"}},{"$f":"IF(OR(islike($V61,\"*2*\"),islike($V61,\"*1B*\")),EZ61*0.5,EZ61)","v":{"$error":"#NAME?"}},{"$f":"IF(OR(islike($V61,\"*2*\"),islike($V61,\"*1B*\")),FA61*0.5,FA61)","v":{"$error":"#NAME?"}},{"$f":"IF(OR(islike($V61,\"*2*\"),islike($V61,\"*1B*\")),FB61*0.5,FB61)","v":{"$error":"#NAME?"}},{"$f":"IF(OR(islike($V61,\"*2*\"),islike($V61,\"*1B*\")),FC61*0.5,FC61)","v":{"$error":"#NAME?"}},null,null,null,null,1,1,1,1,null,null,null,null,null,null,null,null,1,1,1,1,1,null,null,null,null,null,null,null,null,null,null,null,null,null,null,null,null,null,0,"N",null,1,null,null,null,null,null,null,null,null,1,"Y",null,0,null,null,0,"N",null,null,null,null,null,null,{"$f":"IF(PRIinternalgoods=\"y\",1,0)","v":0},null,null,0,"N",null,1,null,null,null,null,null,null,null,null,null,null,null,null,null,{"$f":"IF(RETinternalgoods=\"y\",1,0)","v":0},null,null,null,null,null,1,"Y",null,0,null,null,null,null,null,null,null,null,null,null,0,"N",null,1,null,null,null,null,null,null,null,null,null,null,1,null,null,null,2,"Y",null,null,0,0,0,0,0]
[null,"Ene 7","Kylförvaring","One credit where evidence provided demonstrates that the cold storage refrigeration plant components are on the ECA Energy Technology Product List.\n\nOne credit where evidence provided demonstrates that the cold food storage plant is designed to minimise energy consumption in operation.\n\nOne credit where evidence provided demonstrates that opportunities for heat recovery, free cooling or thermal storage are identified and taken advantage of.",null,"Första poängen\n1. Följande komponenter som specificeras som en del av kyllagringsanläggning eller kyllagringslös-ning uppfyller kriterierna för energieffektivitet, till exempel ECA Energy Technology Product List el-ler motsvarande:\n• Luftkylt kondensoraggregat\n• Automatiska luftavskiljare\n• Kylutrustning för källare\n• Kommersiell kylförvaring (lagring av kall mat)\n• Ridåer, persienner, skjutdörrar och överdrag för kyldiskar \n• Evaporativa kondensorer\n• Förkylning med tryckluft\n• Vätsketryckförstärkning\n• Kylskåp/kyldiskar/frysdiskar\n• Kylkompressorer\n• Styr- och reglersystem för kylanläggning\n\nAndra poängen\n2. Kylsystemet uppfyller följande minimikriterier:\na. Kompressorer, pumpar och fläktar är utrustade med frekvensomriktare, eller kompressorer som reglerar kapaciteten med lyftning av sugventil.\nb. Plastridåer installeras för öppningarna vid kylförvaring\nc. Belysning med låg effekt/värme installeras, till exempel fiberoptik, LED\nd. Behovsstyrd avfrostning av förångare installeras \ne. Installerat kylanläggning har ett datoriserat övervakningssystem med antingen automatisk och/eller programmerbar kontrollenhet för övervakning av följande driftparametrar: \n• Kompressorns sugtemperatur\n• Kompressorns utloppstemperatur\n• Kompressorns elanvändning\n• Sekundär kyltemperatur\n• Omgivningens temperatur\n• Elanvändning\n• Temperatur på inkommande luft/vätska till förångaren\n• Temperatur på utgående luft/vätska till förångaren\nf. Anläggningen är tagen i drift enligt kriterierna för kylförvaring i BREEAM-SE Man 1 (detta betyder inte nödvändigtvis att poäng i BREEAM-indikator Man 1 har uppnåtts).\n\nNotera: Andra poängen är oberoende av första.\n\nTredje poängen\n3. Om anläggningen är utformad enligt någon av följande fria kylnings- eller värmningsstrategier\n• Termisk lagring under perioder med låg belastning för att tillhandahålla ytterligare kylning under perioder med hög kylbelastning\n \nELLER\n• Värmeåtervinning av spillvärme som helt eller delvis uppfyller kriterierna för värme och/eller varmvatten i den aktuella byggnaden eller andra lokala behov, såsom luftportar och luftridå för öppning till kylförvaring.\n\nNotera: Tredje poängen är oberoende av tidigare poäng.","Första poängen\n1. Följande komponenter som specificeras som en del av kyllagringsanläggning eller kyllagringslösning uppfyller kriterierna för energieffektivitet, till exempel ECA Energy Technology Product List eller motsvarande:\n• Luftkylt kondensoraggregat\n• Automatiska luftavskiljare\n• Kylutrustning för källare\n• Kommersiell kylförvaring (lagring av kall mat)\n• Ridåer, persienner, skjutdörrar och överdrag för kyldiskar \n• Evaporativa kondensorer\n• Förkylning med tryckluft\n• Vätsketryckförstärkning\n• Kylskåp/kyldiskar/frysdiskar\n• Kylkompressorer\n• Styr- och reglersystem för kylanläggning\n\nAndra poängen\n2. Kylsystemet uppfyller följande minimikriterier:\na. Kompressorer, pumpar och fläktar är utrustade med frekvensomriktare, eller kompressorer som reglerar kapaciteten med lyftning av sugventil.\nb. Plastridåer installeras för öppningarna vid kylförvaring\nc. Belysning med låg effekt/värme installeras, till exempel fiberoptik, LED\nd. Behovsstyrd avfrostning av förångare installeras \ne. Installerat kylanläggning har ett datoriserat övervakningssystem med antingen automatisk och/eller programmerbar kontrollenhet för övervakning av följande driftparametrar: \n• Kompressorns sugtemperatur\n• Kompressorns utloppstemperatur\n• Kompressorns elanvändning\n• Sekundär kyltemperatur\n• Omgivningens temperatur\n• Elanvändning\n• Temperatur på inkommande luft/vätska till förångaren\n• Temperatur på utgående luft/vätska till förångaren\nf. Anläggningen är tagen i drift enligt kriterierna för kylförvaring i BREEAM-SE Man 1 (detta betyder inte nödvändigtvis att poäng i BREEAM-indikator Man 1 har uppnåtts).\n\nNotera: Andra poängen är oberoende av första.\n\nTredje poängen\n3. Om anläggningen är utformad enligt någon av följande fria kylnings- eller värmningsstrategier\n• Termisk lagring under perioder med låg belastning för att tillhandahålla ytterligare kylning under perioder med hög kylbelastning\n \nELLER\n• Värmeåtervinning av spillvärme som helt eller delvis uppfyller kriterierna för värme och/eller varmvatten i den aktuella byggnaden eller andra lokala behov, såsom luftportar och luftridå för öppning till kylförvaring.\n\nNotera: Tredje poängen är oberoende av tidigare poäng.",{"$f":"$E62","v":0},null,null,null,"Första poängen\n1. Följande komponenter som specificeras som en del av kyllagringsanläggning eller kyllagringslös-ning uppfyller kriterierna för energieffektivitet, till exempel ECA Energy Technology Product List eller motsvarande:\n• Luftkylt kondensoraggregat\n• Automatiska luftavskiljare\n• Kylutrustning för källare\n• Kommersiell kylförvaring (lagring av kall mat)\n• Ridåer, persienner, skjutdörrar och överdrag för kyldiskar \n• Evaporativa kondensorer\n• Förkylning med tryckluft\n• Vätsketryckförstärkning\n• Kylskåp/kyldiskar/frysdiskar\n• Kylkompressorer\n• Styr- och reglersystem för kylanläggning\n\nAndra poängen\n2. Kylsystemet uppfyller följande minimikriterier:\na. Kompressorer, pumpar och fläktar är utrustade med frekvensomriktare, eller kompressorer som reglerar kapaciteten med lyftning av sugventil.\nb. Plastridåer installeras för öppningarna vid kylförvaring\nc. Belysning med låg effekt/värme installeras, till exempel fiberoptik, LED\nd. Behovsstyrd avfrostning av förångare installeras \ne. Installerat kylanläggning har ett datoriserat övervakningssystem med antingen automatisk och/eller programmerbar kontrollenhet för övervakning av följande driftparametrar: \n• Kompressorns sugtemperatur\n• Kompressorns utloppstemperatur\n• Kompressorns elanvändning\n• Sekundär kyltemperatur\n• Omgivningens temperatur\n• Elanvändning\n• Temperatur på inkommande luft/vätska till förångaren\n• Temperatur på utgående luft/vätska till förångaren\nf. Anläggningen är tagen i drift enligt kriterierna för kylförvaring i BREEAM-SE Man 1 (detta betyder inte nödvändigtvis att poäng i BREEAM-indikator Man 1 har uppnåtts).\n\nNotera: Andra poängen är oberoende av första.\n\nTredje poängen\n3. Om anläggningen är utformad enligt någon av följande fria kylnings- eller värmningsstrategier\n• Termisk lagring under perioder med låg belastning för att tillhandahålla ytterligare kylning under perioder med hög kylbelastning\n \nELLER\n• Värmeåtervinning av spillvärme som helt eller delvis uppfyller kriterierna för värme och/eller varmvatten i den aktuella byggnaden eller andra lokala behov, såsom luftportar och luftridå för öppning till kylförvaring.\n\nNotera: Tredje poängen är oberoende av tidigare poäng.","N/A",null,0,null,null,null,null,0,null,null,null,{"$f":"IF(OR(islike($V62,\"*2*\"),islike($V62,\"*1B*\")),EY62*0.5,EY62)","v":{"$error":"#NAME?"}},{"$f":"IF(OR(islike($V62,\"*2*\"),islike($V62,\"*1B*\")),EZ62*0.5,EZ62)","v":{"$error":"#NAME?"}},{"$f":"IF(OR(islike($V62,\"*2*\"),islike($V62,\"*1B*\")),FA62*0.5,FA62)","v":{"$error":"#NAME?"}},{"$f":"IF(OR(islike($V62,\"*2*\"),islike($V62,\"*1B*\")),FB62*0.5,FB62)","v":{"$error":"#NAME?"}},{"$f":"IF(OR(islike($V62,\"*2*\"),islike($V62,\"*1B*\")),FC62*0.5,FC62)","v":{"$error":"#NAME?"}},null,null,null,null,0,3,0,0,null,null,null,null,null,null,null,null,0,3,0,0,3,null,null,null,null,null,null,null,null,null,null,null,null,null,null,null,null,null,0,"N",null,null,null,null,null,null,null,null,null,null,0,"N",null,0,null,null,0,"N",null,null,null,{"$f":"IF(PRIcold=\"y\",1,0)","v":0},null,null,null,null,null,0,"N",null,null,null,null,null,null,null,null,null,null,null,null,{"$f":"IF(TOYOTA=\"y\",0,+IF(RETcold=\"y\",1,0))","v":0},null,null,null,null,null,null,null,null,0,"N",null,0,null,null,null,null,null,null,null,null,null,null,0,"N",null,null,null,null,null,null,null,null,null,null,null,null,null,{"$f":"IF(INDcold=\"y\",1,0)","v":0},null,null,0,"N",null,null,0,0,0,0,0]
[null,"Ene 8","Hissar","Up to two credits are available where evidence provided demonstrates the installation of energy-efficient lift(s).",null,"Första poängen\n1. Projekteringsgruppen genomför en analys av brukarnas transportbehov och åkmönstret utreds för att optimera hissarnas antal och storlek och motviktsförhållande utifrån förväntat passerarbehov. \n2. Energianvändning för minst två olika typer av hissar eller hisstrategier valda efter ändamålet har undersökts och den med lägst energianvändning specificeras.\n\nAndra poängen\n3. Första poängen är uppnådd.\n4. Av följande energieffektiva funktioner, specificeras de tre med störst potential att spara energi:\na. Hissar är i stand-by-läge vid lågtrafik och tomgångsperioder. El till hiss och extrautrustning, till exempel hissbelysning och ventilationsfläkt stängs av när hissen inte är i rörelse.\nb. Hissmotorer använder drivkontroller med möjlighet till variabel hastighet, variabel spänning och frekvensstyrning av drivmotorn.\nc. Hissen har en regenererande enhet så att den energi som hissen genererar (genom att åka tom upp och full ned) återförs till elnätet eller till annan användare på tomten.\nd. Korgen har energieffektiv belysning och displaybelysning (> 60 lm/W eller så är belysning mindre än 5 W, till exempel LED).\n","Första poängen\n1. Projekteringsgruppen genomför en analys av brukarnas transportbehov och åkmönstret utreds för att optimera hissarnas antal och storlek och motviktsförhållande utifrån förväntat passerarbehov. \n2. Energianvändning för minst två olika typer av hissar eller hisstrategier valda efter ändamålet har undersökts och den med lägst energianvändning specificeras.\n\nAndra poängen\n3. Första poängen är uppnådd.\n4. Av följande energieffektiva funktioner, specificeras de tre med störst potential att spara energi:\na. Hissar är i stand-by-läge vid lågtrafik och tomgångsperioder. El till hiss och extrautrustning, till exempel hissbelysning och ventilationsfläkt stängs av när hissen inte är i rörelse.\nb. Hissmotorer använder drivkontroller med möjlighet till variabel hastighet, variabel spänning och frekvensstyrning av drivmotorn.\nc. Hissen har en regenererande enhet så att den energi som hissen genererar (genom att åka tom upp och full ned) återförs till elnätet eller till annan användare på tomten.\nd. Korgen har energieffektiv belysning och displaybelysning (> 60 lm/W eller så är belysning mindre än 5 W, till exempel LED).\n",{"$f":"$D63","v":"Up to two credits are available where evidence provided demonstrates the installation of energy-efficient lift(s)."},null,null,null,"Första poängen\n1. Projekteringsgruppen genomför en analys av brukarnas transportbehov och åkmönstret utreds för att optimera hissarnas antal och storlek och motviktsförhållande utifrån förväntat passerarbehov. \n2. Energianvändning för minst två olika typer av hissar eller hisstrategier valda efter ändamålet har undersökts och den med lägst energianvändning specificeras.\n\nAndra poängen\n3. Första poängen är uppnådd.\n4. Av följande energieffektiva funktioner, specificeras de tre med störst potential att spara energi:\na. Hissar är i stand-by-läge vid lågtrafik och tomgångsperioder. El till hiss och extrautrustning, till exempel hissbelysning och ventilationsfläkt stängs av när hissen inte är i rörelse.\nb. Hissmotorer använder drivkontroller med möjlighet till variabel hastighet, variabel spänning och frekvensstyrning av drivmotorn.\nc. Hissen har en regenererande enhet så att den energi som hissen genererar (genom att åka tom upp och full ned) återförs till elnätet eller till annan användare på tomten.\nd. Korgen har energieffektiv belysning och displaybelysning (> 60 lm/W eller så är belysning mindre än 5 W, till exempel LED).\n",{"$f":"$D63","v":"Up to two credits are available where evidence provided demonstrates the installation of energy-efficient lift(s)."},null,2,null,null,null,null,{"$f":"IF(partnewpartrefurb=\"y\",(Q63*$Q$16)+(R63*$R$16),0)","v":0},null,null,null,{"$f":"IF(OR(islike($V63,\"*2*\"),islike($V63,\"*1B*\")),EY63*0.5,EY63)","v":{"$error":"#NAME?"}},{"$f":"IF(OR(islike($V63,\"*2*\"),islike($V63,\"*1B*\")),EZ63*0.5,EZ63)","v":{"$error":"#NAME?"}},{"$f":"IF(OR(islike($V63,\"*2*\"),islike($V63,\"*1B*\")),FA63*0.5,FA63)","v":{"$error":"#NAME?"}},{"$f":"IF(OR(islike($V63,\"*2*\"),islike($V63,\"*1B*\")),FB63*0.5,FB63)","v":{"$error":"#NAME?"}},{"$f":"IF(OR(islike($V63,\"*2*\"),islike($V63,\"*1B*\")),FC63*0.5,FC63)","v":{"$error":"#NAME?"}},null,null,null,null,0,2,2,2,null,null,null,null,null,null,null,null,0,2,0,2,2,null,null,null,null,null,null,null,null,null,null,null,null,null,{"$f":"IF(HClifts=\"y\",1,0)","v":0},null,null,null,0,"N",null,null,null,null,null,null,null,null,{"$f":"IF(OFFlifts=\"y\",1,0)","v":1},null,1,"Y",null,null,null,{"$f":"IF(COURTSlifts=\"y\",1,0)","v":0},0,"N",null,null,null,null,null,{"$f":"IF(PRIlifts=\"y\",1,0)","v":0},null,null,null,0,"N",null,null,null,null,null,null,null,null,null,null,null,null,null,{"$f":"IF(RETlifts=\"y\",1,0)","v":0},null,null,null,null,null,null,null,0,"N",null,null,null,null,null,null,{"$f":"IF(EDUlifts=\"y\",1,0)","v":0},null,null,null,null,null,0,"N",null,null,null,null,null,null,null,null,null,null,null,null,null,null,null,{"$f":"IF(INDlifts=\"y\",1,0)","v":0},0,"N",null,null,0,0,0,0,0]
[null,"Ene 9","Rulltrappor och rullband","One credit where evidence provided demonstrates that escalators reduce unnecessary operation when there is no passenger demand.",null,"1. Alla rulltrappor och horisontella rullband uppfyller NÅGON av följande:\na. Är utrustade med lastavkänning som synkroniserar motoreffekt efter passagerarbehov med en frekvensomriktare. ELLER\nb. Är utrustad med sensorsystem för automatisk drift så att rulltrappor är i vänteläge när det inte finns något transportbehov. \n","1. Alla rulltrappor och horisontella rullband uppfyller NÅGON av följande:\na. Är utrustade med lastavkänning som synkroniserar motoreffekt efter passagerarbehov med en frekvensomriktare. ELLER\nb. Är utrustad med sensorsystem för automatisk drift så att rulltrappor är i vänteläge när det inte finns något transportbehov. \n",{"$f":"$E64","v":0},null,null,null,"\n1. Alla rulltrappor och horisontella rullband uppfyller NÅGON av följande:\na. Är utrustade med lastavkänning som synkroniserar motoreffekt efter passagerarbehov med en frekvensomriktare. ELLER\nb. Är utrustad med sensorsystem för automatisk drift så att rulltrappor är i vänteläge när det inte finns något transportbehov. \n","N/A",null,1,null,null,null,null,{"$f":"IF(partnewpartrefurb=\"y\",(Q64*$Q$16)+(R64*$R$16),0)","v":0},null,null,null,{"$f":"IF(OR(islike($V64,\"*2*\"),islike($V64,\"*1B*\")),EY64*0.5,EY64)","v":{"$error":"#NAME?"}},{"$f":"IF(OR(islike($V64,\"*2*\"),islike($V64,\"*1B*\")),EZ64*0.5,EZ64)","v":{"$error":"#NAME?"}},{"$f":"IF(OR(islike($V64,\"*2*\"),islike($V64,\"*1B*\")),FA64*0.5,FA64)","v":{"$error":"#NAME?"}},{"$f":"IF(OR(islike($V64,\"*2*\"),islike($V64,\"*1B*\")),FB64*0.5,FB64)","v":{"$error":"#NAME?"}},{"$f":"IF(OR(islike($V64,\"*2*\"),islike($V64,\"*1B*\")),FC64*0.5,FC64)","v":{"$error":"#NAME?"}},null,null,null,null,0,1,1,1,null,null,null,null,null,null,null,null,0,0,0,0,1,null,null,null,null,null,null,null,null,null,null,null,null,null,null,null,null,null,0,"N",null,null,null,null,null,null,null,null,null,{"$f":"IF(OFFescalators=\"y\",1,0)","v":1},{"$f":"SUM(BR64:BZ64)","v":1},"Y",null,0,null,null,0,"N",null,0,null,null,null,null,null,null,null,0,"N",null,null,null,null,null,null,null,null,null,null,null,null,null,null,{"$f":"IF(TOYOTA=\"y\",0,+IF(RETescalator=\"y\",1,0))","v":0},null,null,null,null,null,null,0,"N",null,0,null,null,null,null,null,null,null,null,null,null,0,"N",null,0,null,null,null,null,null,null,null,null,null,null,null,null,null,null,0,"N",null,null,0,0,0,0,0]
[null,"Ene 10","Free Cooling","One credit where evidence provided demonstrates the building incorporates a free cooling strategy that completely displaces the need for conventional mechanical cooling systems (excluding exceptional localised circumstances with small scale systems, for example server rooms) and the thermal comfort requirements of credit Hea 10 are achieved.",null,"N/A","N/A",{"$f":"$E65","v":0},null,null,null,"N/A","N/A",null,0,null,null,null,null,0,null,null,null,{"$f":"IF(OR(islike($V65,\"*2*\"),islike($V65,\"*1B*\")),EY65*0.5,EY65)","v":{"$error":"#NAME?"}},{"$f":"IF(OR(islike($V65,\"*2*\"),islike($V65,\"*1B*\")),EZ65*0.5,EZ65)","v":{"$error":"#NAME?"}},{"$f":"IF(OR(islike($V65,\"*2*\"),islike($V65,\"*1B*\")),FA65*0.5,FA65)","v":{"$error":"#NAME?"}},{"$f":"IF(OR(islike($V65,\"*2*\"),islike($V65,\"*1B*\")),FB65*0.5,FB65)","v":{"$error":"#NAME?"}},{"$f":"IF(OR(islike($V65,\"*2*\"),islike($V65,\"*1B*\")),FC65*0.5,FC65)","v":{"$error":"#NAME?"}},null,null,null,null,0,0,0,0,null,null,null,null,null,null,null,null,0,0,0,0,null,null,null,null,null,null,null,null,null,null,null,null,null,null,null,null,null,null,0,"N",null,null,null,null,null,null,null,null,null,null,0,"N",null,0,null,null,0,"N",null,0,null,null,null,null,null,null,null,0,"N",null,0,null,null,null,null,null,null,null,null,null,null,null,null,null,null,null,null,null,null,null,0,"N",null,1,null,null,null,null,null,null,null,null,null,null,1,"Y",null,0,null,null,null,null,null,null,null,null,null,null,null,null,null,null,0,"N",null,null,0,0,0,0,0]
[null,"Ene 11","Energy Efficient Fume Cupboards","One credit where evidence provided demonstrates that, where fume cupboards are specified, a study has been carried out to determine the most energy-efficient strategy for ventilation of the fume cupboards in the laboratory, whilst maintaining adequate containment.",null,"N/A","N/A",{"$f":"$E66","v":0},null,null,null,"N/A","N/A",null,0,null,null,null,null,0,null,null,null,{"$f":"IF(OR(islike($V66,\"*2*\"),islike($V66,\"*1B*\")),EY66*0.5,EY66)","v":{"$error":"#NAME?"}},{"$f":"IF(OR(islike($V66,\"*2*\"),islike($V66,\"*1B*\")),EZ66*0.5,EZ66)","v":{"$error":"#NAME?"}},{"$f":"IF(OR(islike($V66,\"*2*\"),islike($V66,\"*1B*\")),FA66*0.5,FA66)","v":{"$error":"#NAME?"}},{"$f":"IF(OR(islike($V66,\"*2*\"),islike($V66,\"*1B*\")),FB66*0.5,FB66)","v":{"$error":"#NAME?"}},{"$f":"IF(OR(islike($V66,\"*2*\"),islike($V66,\"*1B*\")),FC66*0.5,FC66)","v":{"$error":"#NAME?"}},null,null,null,null,0,0,0,0,null,null,null,null,null,null,null,null,0,0,0,0,null,null,null,null,null,null,null,null,null,null,null,null,null,null,null,null,null,null,0,"N",null,null,null,null,null,null,null,null,null,null,0,"N",null,0,null,null,0,"N",null,0,null,null,null,null,null,null,null,0,"N",null,0,null,null,null,null,null,null,null,null,null,null,null,null,null,null,null,null,null,null,null,0,"N",null,null,null,null,null,null,null,{"$f":"IF(EDUfume=\"y\",1,0)","v":0},null,null,null,null,0,"N",null,0,null,null,null,null,null,null,null,null,null,null,null,null,null,null,0,"N",null,null,0,0,0,0,0]
[null,"Ene 12","Swimming pool ventilation and heat loss","One credit where evidence provided demonstrates that automatic or semi-automatic pool covers are fitted to ALL pools within the building.",null,"N/A","N/A",{"$f":"$E67","v":0},null,null,null,"N/A","N/A",null,0,null,null,null,null,{"$f":"IF(partnewpartrefurb=\"y\",Q67,0)","v":0},null,null,null,{"$f":"IF(OR(islike($V67,\"*2*\"),islike($V67,\"*1B*\")),EY67*0.5,EY67)","v":{"$error":"#NAME?"}},{"$f":"IF(OR(islike($V67,\"*2*\"),islike($V67,\"*1B*\")),EZ67*0.5,EZ67)","v":{"$error":"#NAME?"}},{"$f":"IF(OR(islike($V67,\"*2*\"),islike($V67,\"*1B*\")),FA67*0.5,FA67)","v":{"$error":"#NAME?"}},{"$f":"IF(OR(islike($V67,\"*2*\"),islike($V67,\"*1B*\")),FB67*0.5,FB67)","v":{"$error":"#NAME?"}},{"$f":"IF(OR(islike($V67,\"*2*\"),islike($V67,\"*1B*\")),FC67*0.5,FC67)","v":{"$error":"#NAME?"}},null,null,null,null,0,0,0,0,null,null,null,null,null,null,null,null,0,0,0,0,null,null,null,null,null,null,null,null,null,null,null,null,null,null,null,null,null,null,0,"N",null,null,null,null,null,null,null,null,null,null,0,"N",null,0,null,null,0,"N",null,null,null,null,{"$f":"IF(PRIpool=\"y\",1,0)","v":0},null,null,null,null,0,"N",null,0,null,null,null,null,null,null,null,null,null,null,null,null,null,null,null,null,null,null,null,0,"N",null,null,null,null,null,null,null,null,{"$f":"IF(EDUswimming=\"y\",1,0)","v":0},null,null,null,0,"N",null,0,null,null,null,null,null,null,null,null,null,null,null,null,null,null,0,"N",null,null,0,0,0,0,0]
[null,"Ene 13","Labelled lighting controls","One credit where evidence provided demonstrates that lighting controls are clearly labelled for appropriate use.",null,"N/A","N/A",{"$f":"$E68","v":0},null,null,null,"N/A","N/A",null,0,null,null,null,null,0,null,null,null,{"$f":"IF(OR(islike($V68,\"*2*\"),islike($V68,\"*1B*\")),EY68*0.5,EY68)","v":{"$error":"#NAME?"}},{"$f":"IF(OR(islike($V68,\"*2*\"),islike($V68,\"*1B*\")),EZ68*0.5,EZ68)","v":{"$error":"#NAME?"}},{"$f":"IF(OR(islike($V68,\"*2*\"),islike($V68,\"*1B*\")),FA68*0.5,FA68)","v":{"$error":"#NAME?"}},{"$f":"IF(OR(islike($V68,\"*2*\"),islike($V68,\"*1B*\")),FB68*0.5,FB68)","v":{"$error":"#NAME?"}},{"$f":"IF(OR(islike($V68,\"*2*\"),islike($V68,\"*1B*\")),FC68*0.5,FC68)","v":{"$error":"#NAME?"}},null,null,null,null,0,0,0,0,null,null,null,null,null,null,null,null,0,0,0,0,null,null,null,null,null,null,null,null,null,null,null,null,null,null,null,null,null,null,0,"N",null,null,null,null,null,null,null,null,null,null,0,"N",null,0,null,null,0,"N",null,1,null,null,null,null,null,null,null,1,"Y",null,0,null,null,null,null,null,null,null,null,null,null,null,null,null,null,null,null,null,null,null,0,"N",null,0,null,null,null,null,null,null,null,null,null,null,0,"N",null,0,null,null,null,null,null,null,null,null,null,null,null,null,null,null,0,"N",null,null,0,0,0,0,0]
[null,"Ene 14","BMS","One credit where evidence provided demonstrates that a Building Management Control System (BMS) is installed.",null,"N/A","N/A","N/A",null,null,null,"N/A","N/A",null,0,null,null,null,null,0,null,null,null,{"$f":"IF(OR(islike($V69,\"*2*\"),islike($V69,\"*1B*\")),EY69*0.5,EY69)","v":{"$error":"#NAME?"}},{"$f":"IF(OR(islike($V69,\"*2*\"),islike($V69,\"*1B*\")),EZ69*0.5,EZ69)","v":{"$error":"#NAME?"}},{"$f":"IF(OR(islike($V69,\"*2*\"),islike($V69,\"*1B*\")),FA69*0.5,FA69)","v":{"$error":"#NAME?"}},{"$f":"IF(OR(islike($V69,\"*2*\"),islike($V69,\"*1B*\")),FB69*0.5,FB69)","v":{"$error":"#NAME?"}},{"$f":"IF(OR(islike($V69,\"*2*\"),islike($V69,\"*1B*\")),FC69*0.5,FC69)","v":{"$error":"#NAME?"}},null,null,null,null,0,0,0,0,null,null,null,null,null,null,null,null,0,0,0,0,null,null,null,null,null,null,null,null,null,null,null,null,null,null,null,null,null,null,{"$f":"SUM(BA69:BN69)","v":0},"N",null,null,null,null,null,null,null,null,null,null,0,"N",null,0,null,null,0,"N",null,1,null,null,null,null,null,null,null,1,"Y",null,0,null,null,null,null,null,null,null,null,null,null,null,null,null,null,null,null,null,null,null,0,"N",null,0,null,null,null,null,null,null,null,null,null,null,0,"N",null,0,null,null,null,null,null,null,null,null,null,null,null,null,null,null,0,"N",null,null,0,0,0,0,0]
[null,"Ene 15","Provision of Energy Efficient Equipment","One credit where evidence provided demonstrates procurement of office and domestic scale equipment on the basis of energy-efficient performance over the product life cycle.",null,"N/A","N/A",{"$f":"$F70","v":"N/A"},null,null,null,"N/A","N/A",null,0,null,null,null,null,{"$f":"IF(partnewpartrefurb=\"y\",Q70,0)","v":0},null,null,null,{"$f":"IF(OR(islike($V70,\"*2*\"),islike($V70,\"*1B*\")),EY70*0.5,EY70)","v":{"$error":"#NAME?"}},{"$f":"IF(OR(islike($V70,\"*2*\"),islike($V70,\"*1B*\")),EZ70*0.5,EZ70)","v":{"$error":"#NAME?"}},{"$f":"IF(OR(islike($V70,\"*2*\"),islike($V70,\"*1B*\")),FA70*0.5,FA70)","v":{"$error":"#NAME?"}},{"$f":"IF(OR(islike($V70,\"*2*\"),islike($V70,\"*1B*\")),FB70*0.5,FB70)","v":{"$error":"#NAME?"}},{"$f":"IF(OR(islike($V70,\"*2*\"),islike($V70,\"*1B*\")),FC70*0.5,FC70)","v":{"$error":"#NAME?"}},null,null,null,null,0,0,0,0,null,null,null,null,null,null,null,null,0,0,0,0,null,null,null,null,1,null,null,null,null,null,null,null,null,null,null,null,null,null,1,{"$f":"IF(BO70>=0.1,\"Y\",\"N\")","v":"Y"},null,null,null,null,null,null,null,null,null,null,0,"N",null,0,null,null,0,"N",null,0,null,null,null,null,null,null,null,0,"N",null,0,null,null,null,null,null,null,null,null,null,null,null,null,null,null,null,null,null,null,null,0,"N",null,0,null,null,null,null,null,null,null,null,null,null,0,"N",null,0,null,null,null,null,null,null,null,null,null,null,null,null,null,null,0,"N",null,null,0,0,0,0,0]
[null,"Ene 16","CHP Community Energy","One credit where evidence provided demonstrates that a feasibility study has been carried out on the potential for the building to set up, contribute to or benefit from a local CHP community energy scheme.",null,"N/A","N/A",{"$f":"$F71","v":"N/A"},null,null,null,"N/A","N/A",null,0,null,null,null,null,{"$f":"IF(partnewpartrefurb=\"y\",Q71,0)","v":0},null,null,null,{"$f":"IF(OR(islike($V71,\"*2*\"),islike($V71,\"*1B*\")),EY71*0.5,EY71)","v":{"$error":"#NAME?"}},{"$f":"IF(OR(islike($V71,\"*2*\"),islike($V71,\"*1B*\")),EZ71*0.5,EZ71)","v":{"$error":"#NAME?"}},{"$f":"IF(OR(islike($V71,\"*2*\"),islike($V71,\"*1B*\")),FA71*0.5,FA71)","v":{"$error":"#NAME?"}},{"$f":"IF(OR(islike($V71,\"*2*\"),islike($V71,\"*1B*\")),FB71*0.5,FB71)","v":{"$error":"#NAME?"}},{"$f":"IF(OR(islike($V71,\"*2*\"),islike($V71,\"*1B*\")),FC71*0.5,FC71)","v":{"$error":"#NAME?"}},null,null,null,null,0,0,0,0,null,null,null,null,null,null,null,null,0,0,0,0,null,null,null,null,1,null,null,null,null,null,null,null,null,null,null,null,null,null,1,"Y",null,null,null,null,null,null,null,null,null,null,0,"N",null,0,null,null,0,"N",null,0,null,null,null,null,null,null,null,0,"N",null,0,null,null,null,null,null,null,null,null,null,null,null,null,null,null,null,null,null,null,null,0,"N",null,0,null,null,null,null,null,null,null,null,null,null,0,"N",null,0,null,null,null,null,null,null,null,null,null,null,null,null,null,null,0,"N",null,null,0,0,0,0,0]
[null,"Ene 17","Residential areas - energy consumption",null,null,"N/A","N/A",{"$f":"$E72","v":0},null,null,null,"N/A","N/A",null,0,null,null,null,null,0,null,null,null,{"$f":"IF(OR(islike($V72,\"*2*\"),islike($V72,\"*1B*\")),EY72*0.5,EY72)","v":{"$error":"#NAME?"}},{"$f":"IF(OR(islike($V72,\"*2*\"),islike($V72,\"*1B*\")),EZ72*0.5,EZ72)","v":{"$error":"#NAME?"}},{"$f":"IF(OR(islike($V72,\"*2*\"),islike($V72,\"*1B*\")),FA72*0.5,FA72)","v":{"$error":"#NAME?"}},{"$f":"IF(OR(islike($V72,\"*2*\"),islike($V72,\"*1B*\")),FB72*0.5,FB72)","v":{"$error":"#NAME?"}},{"$f":"IF(OR(islike($V72,\"*2*\"),islike($V72,\"*1B*\")),FC72*0.5,FC72)","v":{"$error":"#NAME?"}},null,null,null,null,0,0,0,0,null,null,null,null,null,null,null,null,0,0,0,0,null,null,null,null,null,null,null,null,null,null,null,null,null,null,null,null,null,null,{"$f":"SUM(BA72:BN72)","v":0},"N",null,null,null,null,null,null,null,null,null,null,0,"N",null,0,null,null,0,"N",null,0,null,null,null,null,null,null,null,0,"N",null,0,null,null,null,null,null,null,null,null,null,null,null,null,null,null,null,null,null,null,null,0,"N",null,0,null,null,null,null,null,null,null,null,null,null,0,"N",null,0,null,null,null,null,null,null,null,null,null,null,null,null,null,null,0,"N",null,null,0,0,0,0,0]
[null,null,null,null,null,null,null,{"$f":"$E73","v":0},null,null,null,null,null,null,0,null,null,null,null,0,null,null,null,{"$f":"IF(OR(islike($V73,\"*2*\"),islike($V73,\"*1B*\")),EY73*0.5,EY73)","v":{"$error":"#NAME?"}},{"$f":"IF(OR(islike($V73,\"*2*\"),islike($V73,\"*1B*\")),EZ73*0.5,EZ73)","v":{"$error":"#NAME?"}},{"$f":"IF(OR(islike($V73,\"*2*\"),islike($V73,\"*1B*\")),FA73*0.5,FA73)","v":{"$error":"#NAME?"}},{"$f":"IF(OR(islike($V73,\"*2*\"),islike($V73,\"*1B*\")),FB73*0.5,FB73)","v":{"$error":"#NAME?"}},{"$f":"IF(OR(islike($V73,\"*2*\"),islike($V73,\"*1B*\")),FC73*0.5,FC73)","v":{"$error":"#NAME?"}},null,null,null,null,0,0,0,0,null,null,null,null,null,null,null,null,0,0,0,0,null,null,null,null,null,null,null,null,null,null,null,null,null,null,null,null,null,null,{"$f":"SUM(BA73:BN73)","v":0},"N",null,null,null,null,null,null,null,null,null,null,0,"N",null,0,null,null,0,"N",null,0,null,null,null,null,null,null,null,0,"N",null,0,null,null,null,null,null,null,null,null,null,null,null,null,null,null,null,null,null,null,null,0,"N",null,0,null,null,null,null,null,null,null,null,null,null,0,"N",null,0,null,null,null,null,null,null,null,null,null,null,null,null,null,null,0,"N",null,null,0,0,0,0,0]
[null,null,null,null,null,null,null,{"$f":"$E74","v":0},null,null,null,null,null,null,0,null,null,null,null,0,null,null,null,{"$f":"IF(OR(islike($V74,\"*2*\"),islike($V74,\"*1B*\")),EY74*0.5,EY74)","v":{"$error":"#NAME?"}},{"$f":"IF(OR(islike($V74,\"*2*\"),islike($V74,\"*1B*\")),EZ74*0.5,EZ74)","v":{"$error":"#NAME?"}},{"$f":"IF(OR(islike($V74,\"*2*\"),islike($V74,\"*1B*\")),FA74*0.5,FA74)","v":{"$error":"#NAME?"}},{"$f":"IF(OR(islike($V74,\"*2*\"),islike($V74,\"*1B*\")),FB74*0.5,FB74)","v":{"$error":"#NAME?"}},{"$f":"IF(OR(islike($V74,\"*2*\"),islike($V74,\"*1B*\")),FC74*0.5,FC74)","v":{"$error":"#NAME?"}},null,null,null,null,0,0,0,0,null,null,null,null,null,null,null,null,0,0,0,0,null,null,null,null,null,null,null,null,null,null,null,null,null,null,null,null,null,null,0,"N",null,null,null,null,null,null,null,null,null,null,0,"N",null,0,null,null,0,"N",null,0,null,null,null,null,null,null,null,0,"N",null,0,null,null,null,null,null,null,null,null,null,null,null,null,null,null,null,null,null,null,null,0,"N",null,0,null,null,null,null,null,null,null,null,null,null,0,"N",null,0,null,null,null,null,null,null,null,null,null,null,null,null,null,null,0,"N",null,null,0,0,0,0,0]
[null,"Ene 10","Inomhusbelysning",null,null,"1. Installerad belysningseffekt W/m2 för belysning inomhus ska vara mindre eller lika med \"bör-värden\" i svenska normer ur \"Ljus & Rum, 2012\" eller nyare, se nedan. \n2. Lämpliga kontrollmöjligheter för belysningen installeras. \n","1. Installerad belysningseffekt W/m2 för belysning inomhus ska vara mindre eller lika med \"bör-värden\" i svenska normer ur \"Ljus & Rum, 2012\" eller nyare, se nedan. \n2. Lämpliga kontrollmöjligheter för belysningen installeras. \n",null,null,null,null,"1. Installerad belysningseffekt W/m2 för belysning inomhus ska vara mindre eller lika med \"bör-värden\" i svenska normer ur \"Ljus & Rum, 2012\" eller nyare, se nedan. \n2. Lämpliga kontrollmöjligheter för belysningen installeras. \n",null,null,2,null,null,null,null,0,null,null,null,{"$f":"IF(OR(islike($V75,\"*2*\"),islike($V75,\"*1B*\")),EY75*0.5,EY75)","v":{"$error":"#NAME?"}},{"$f":"IF(OR(islike($V75,\"*2*\"),islike($V75,\"*1B*\")),EZ75*0.5,EZ75)","v":{"$error":"#NAME?"}},{"$f":"IF(OR(islike($V75,\"*2*\"),islike($V75,\"*1B*\")),FA75*0.5,FA75)","v":{"$error":"#NAME?"}},{"$f":"IF(OR(islike($V75,\"*2*\"),islike($V75,\"*1B*\")),FB75*0.5,FB75)","v":{"$error":"#NAME?"}},{"$f":"IF(OR(islike($V75,\"*2*\"),islike($V75,\"*1B*\")),FC75*0.5,FC75)","v":{"$error":"#NAME?"}},null,null,null,null,4,4,2,2,null,null,null,null,null,null,null,null,2,2,0,0,2,null,null,null,null,null,null,null,null,null,null,null,null,null,null,null,null,null,0,"N",null,2,null,2,null,null,null,null,null,null,{"$f":"SUM(BR75:BZ75)","v":4},{"$f":"IF(CA75>=0.1,\"Y\",\"N\")","v":"Y"},null,null,null,null,null,null,null,null,null,null,null,null,null,null,null,null,null,null,4,null,4,null,null,null,null,null,null,null,null,null,null,null,null,null,null,null,null,null,8,"Y",null,null,null,null,null,null,null,null,null,null,null,null,null,null,null,2,null,2,null,null,null,null,null,null,null,null,null,null,null,null,4,"Y",null,null,0,0,0,0,0]
[null,"Transport "]
[null,"Tra 1","Tillgång till kollektivtrafik",null,null," KONTOR\nFörsta poängen\n1. Avståndet från byggnadens entré till knutpunkt för kollektivtrafik (busshållplats, station etc.) är mindre än 500 m.\n2. Knutpunkten för kollektivtrafik har avgångar till ett lokalt tätortscentrum minst var 15:e minut under högtrafik (det vill säga 07:00 - 09:00 och 17:00 - 19:00) på vardagar.\n\nAndra poängen\n1. Avståndet från byggnadens entré till knutpunkt för kollektivtrafik (busshållplats, station etc.) är mindre än 500 m.\n2. Knutpunkten för kollektivtrafik har avgångar minst var 30:e minut under arbetsdagar (det vill säga 08:00 -19:00) till en större transportknutpunkt som betjänar lokala och regionala infrastruktursystem.\n\n HANDEL\n1. Det finns kollektiv transportservice från en närliggande knutpunkt med trafik till och/eller från ett lo-kalt tätortscentrum.\nTabellen nedan används för att fastställa antalet poäng utifrån kollektivtrafikens turtäthet och avstånd till den bedömda byggnaden.\n\n INDUSTRI\n1. Det finns kollektiv transportservice från en närliggande knutpunkt med trafik till och/eller från ett lokalt tätortscentrum.\n2. Tabellen nedan används för att fastställa antalet poäng utifrån kollektivtrafikens turtäthet och av-stånd till den bedömda byggnaden.","ENDAST KONTOR\nFörsta poängen\n1. Avståndet från byggnadens entré till knutpunkt för kollektivtrafik (busshållplats, station etc.) är mindre än 500 m.\n2. Knutpunkten för kollektivtrafik har avgångar till ett lokalt tätortscentrum minst var 15:e minut under högtrafik (det vill säga 07:00 - 09:00 och 17:00 - 19:00) på vardagar.\n\nAndra poängen\n1. Avståndet från byggnadens entré till knutpunkt för kollektivtrafik (busshållplats, station etc.) är mindre än 500 m.\n2. Knutpunkten för kollektivtrafik har avgångar minst var 30:e minut under arbetsdagar (det vill säga 08:00 -19:00) till en större transportknutpunkt som betjänar lokala och regionala infrastruktursystem.\n\nENDAST HANDEL\n1. Det finns kollektiv transportservice från en närliggande knutpunkt med trafik till och/eller från ett lokalt tätortscentrum.\nTabellen nedan används för att fastställa antalet poäng utifrån kollektivtrafikens turtäthet och avstånd till den bedömda byggnaden.\n\nENDAST INDUSTRI\n1. Det finns kollektiv transportservice från en närliggande knutpunkt med trafik till och/eller från ett lokalt tätortscentrum.\n2. Tabellen nedan används för att fastställa antalet poäng utifrån kollektivtrafikens turtäthet och avstånd till den bedömda byggnaden.","Up to five credits are awarded on a sliding scale based on the assessed buildings’ accessibility to the public transport network.\n\nPlus one additional credit (to a maximum of 5) where evidence is provided to demonstrate adequate provision for a taxi drop-off point.",null,null,null,"ENDAST KONTOR\nFörsta poängen\n1. Avståndet från byggnadens entré till knutpunkt för kollektivtrafik (busshållplats, station etc.) är mindre än 500 m.\n2. Knutpunkten för kollektivtrafik har avgångar till ett lokalt tätortscentrum minst var 15:e minut under högtrafik (det vill säga 07:00 - 09:00 och 17:00 - 19:00) på vardagar.\n\nAndra poängen\n1. Avståndet från byggnadens entré till knutpunkt för kollektivtrafik (busshållplats, station etc.) är mindre än 500 m.\n2. Knutpunkten för kollektivtrafik har avgångar minst var 30:e minut under arbetsdagar (det vill säga 08:00 -19:00) till en större transportknutpunkt som betjänar lokala och regionala infrastruktursystem.\n\nENDAST HANDEL\n1. Det finns kollektiv transportservice från en närliggande knutpunkt med trafik till och/eller från ett lokalt tätortscentrum.\nTabellen nedan används för att fastställa antalet poäng utifrån kollektivtrafikens turtäthet och avstånd till den bedömda byggnaden.\n\nENDAST INDUSTRI\n1. Det finns kollektiv transportservice från en närliggande knutpunkt med trafik till och/eller från ett lo-kalt tätortscentrum.\n2. Tabellen nedan används för att fastställa antalet poäng utifrån kollektivtrafikens turtäthet och avstånd till den bedömda byggnaden.","Up to four credits can be awarded based on the proximity of the development to a public transport node with a good service frequency. Determined using the BREEAM Public Transport Table",null,{"$f":"IF(HC=\"y\",AE77,+IF(Ret=\"y\",AG77,+IF(OFF=\"y\",AI77,+IF(TOYOTA=\"y\",AU77,+IF(PRISONS=\"y\",AM77,+IF(SCHOOLS=\"y\",AO77,+IF(FE=\"y\",AQ77,+IF(INDUSTRIAL=\"y\",AS77))))))))","v":2},null,null,null,null,{"$f":"IF(partnewpartrefurb=\"y\",Q77,0)","v":0},null,null,null,{"$f":"IF(OR(islike($V77,\"*2*\"),islike($V77,\"*1B*\")),EY77*0.5,EY77)","v":{"$error":"#NAME?"}},{"$f":"IF(OR(islike($V77,\"*2*\"),islike($V77,\"*1B*\")),EZ77*0.5,EZ77)","v":{"$error":"#NAME?"}},{"$f":"IF(OR(islike($V77,\"*2*\"),islike($V77,\"*1B*\")),FA77*0.5,FA77)","v":{"$error":"#NAME?"}},{"$f":"IF(OR(islike($V77,\"*2*\"),islike($V77,\"*1B*\")),FB77*0.5,FB77)","v":{"$error":"#NAME?"}},{"$f":"IF(OR(islike($V77,\"*2*\"),islike($V77,\"*1B*\")),FC77*0.5,FC77)","v":{"$error":"#NAME?"}},null,null,null,null,{"$f":"IF(DP77=\"y\",AH77,0)","v":4},4,{"$f":"IF(CB77=\"y\",AJ77,0)","v":2},2,null,null,null,null,null,null,null,null,{"$f":"IF(EV77=\"y\",AT77,0)","v":2},2,{"$f":"IF(DP77=\"y\",AV77,0)","v":4},4,4,null,null,null,1,null,null,null,null,null,null,null,null,null,null,null,null,null,1,"Y",null,1,null,null,null,null,null,null,null,null,1,"Y",null,1,null,null,1,"Y",null,1,null,null,null,null,null,null,null,1,"Y",null,1,null,null,null,null,null,null,null,null,null,null,null,null,null,null,null,null,null,null,null,{"$f":"SUM(CU77:DN77)","v":1},"Y",null,1,null,null,null,null,null,null,null,null,null,null,1,"Y",null,1,null,null,null,null,null,null,null,null,null,null,null,null,null,null,{"$f":"SUM(EF77:ET77)","v":1},"Y",null,null,0,0,0,0,0]
[null,"Tra 2","Närhet till service- och tjänsteutbud","One credit where evidence provided demonstrates that the building is located within 500m of accessible local amenities appropriate to the building type and its users.",null," 1. Vid utbyggnad på landsbygden, ligger byggnaden inom 500 m från följande service och tjänster:\na. Matbutik och/eller matförsäljning\nb. Postfaciliteter (brevlåda är tillräckligt)\n2. För all annan utbyggnad ska byggnaden dessutom vara placerad inom 1 000 m från minst två av följande:\na. Bank/Bankomat\nb. Förskola/skola\nc. Frisör\nd. Läkare/vårdcentral\ne. Apotek, möjlighet till inköp av receptbelagd medicin (inte endast apoteksvaror)\nf. Kemtvätt\n"," 1. Vid utbyggnad på landsbygden, ligger byggnaden inom 500 m från följande service och tjänster:\na. Matbutik och/eller matförsäljning\nb. Postfaciliteter (brevlåda är tillräckligt)\n2. För all annan utbyggnad ska byggnaden dessutom vara placerad inom 1 000 m från minst två av följande:\na. Bank/Bankomat\nb. Förskola/skola\nc. Frisör\nd. Läkare/vårdcentral\ne. Apotek, möjlighet till inköp av receptbelagd medicin (inte endast apoteksvaror)\nf. Kemtvätt\n",{"$f":"$D78","v":"One credit where evidence provided demonstrates that the building is located within 500m of accessible local amenities appropriate to the building type and its users."},null,null,null," 1. Vid utbyggnad på landsbygden, ligger byggnaden inom 500 m från följande service och tjänster:\na. Matbutik och/eller matförsäljning\nb. Postfaciliteter (brevlåda är tillräckligt)\n2. För all annan utbyggnad ska byggnaden dessutom vara placerad inom 1 000 m från minst två av följande:\na. Bank/Bankomat\nb. Förskola/skola\nc. Frisör\nd. Läkare/vårdcentral\ne. Apotek, möjlighet till inköp av receptbelagd medicin (inte endast apoteksvaror)\nf. Kemtvätt\n",{"$f":"$D78","v":"One credit where evidence provided demonstrates that the building is located within 500m of accessible local amenities appropriate to the building type and its users."},null,1,null,null,null,null,0,null,null,null,{"$f":"IF(OR(islike($V78,\"*2*\"),islike($V78,\"*1B*\")),EY78*0.5,EY78)","v":{"$error":"#NAME?"}},{"$f":"IF(OR(islike($V78,\"*2*\"),islike($V78,\"*1B*\")),EZ78*0.5,EZ78)","v":{"$error":"#NAME?"}},{"$f":"IF(OR(islike($V78,\"*2*\"),islike($V78,\"*1B*\")),FA78*0.5,FA78)","v":{"$error":"#NAME?"}},{"$f":"IF(OR(islike($V78,\"*2*\"),islike($V78,\"*1B*\")),FB78*0.5,FB78)","v":{"$error":"#NAME?"}},{"$f":"IF(OR(islike($V78,\"*2*\"),islike($V78,\"*1B*\")),FC78*0.5,FC78)","v":{"$error":"#NAME?"}},null,null,null,null,1,1,1,1,null,null,null,null,null,null,null,null,1,1,1,1,1,null,null,null,1,null,null,null,null,null,null,null,null,null,null,null,null,null,1,"Y",null,1,null,null,null,null,null,null,null,null,1,"Y",null,1,null,null,1,"Y",null,0,null,null,null,null,null,null,null,0,"N",null,1,null,null,null,null,null,null,null,null,null,null,null,null,null,null,null,null,null,null,null,1,"Y",null,1,null,null,null,null,null,null,null,null,null,null,1,"Y",null,1,null,null,null,null,null,null,null,null,null,null,null,null,null,null,1,"Y",null,null,0,0,0,0,0]
[null,"Tra 3","Alternativa transportsätt","Two credits can be awarded where one of the following measures has been implemented to encourage the use of alternatives to the private car for commuting:\n\nOption 1 – provision of compliant cycle storage spaces according to the number of building users and of compliant facilities including showers, changing facilities and lockers for clothes and drying space for wet clothes\n\nOption 2 – Cooperation with the local authority for the development and implementation of a proposition to improve the local cycling network\n\nOption 3 - Negotiations with local bus companies have resulted in an increase of the local service provision in the development’s local area.\n\nOption 4 – provision of electric recharging stations using electricity from a renewable source\n\nOption 5 – development and implementation of a car sharing platform as well as adequate car parking capacity and spaces\n\n\n\n",null,"För två poäng ska kraven i ett av följande alternativ vara uppfyllda. De uppmuntrar till att välja alternativ till att pendla med egen bil:\n\nAlternativ 1\nFörsta poängen \n1. Kontors- och industriprojekt: antalet erbjudna accepterade cykelparkeringar är:\na. 10 % av antalet brukare i byggnaden upp till 500 PLUS\nb. 7 % av antalet brukare i byggnaden i intervallet 501 – 1 000 PLUS\nc. 5 % av antalet brukare i byggnaden över 1 000\nDetta under förutsättning att minst 2 cykelparkeringar erbjuds.\n\n2. Handelsprojekt: antalet erbjudna accepterade cykelparkeringar är:\na. 10 % av antalet heltidsarbetande anställda som kommer att pendla till projektet PLUS\nb. 5 % av det totala antalet kundbilparkeringar (ej platser för funktionshindrade eller eventuella familjeplatser). Detta under förutsättning att minst 10 cykelställ finns. Varje projekt med minst 50 cykelparkeringar för kunder kommer att premieras oavsett antalet parkeringsplatser\nParkeringar för anställda ska finnas utöver de som finns för kunder, och även om de inte behöver vara åtskilda bör det uppmuntras.\n\nAndra poängen \n1. Första poängen har uppnåtts.\n2. Minst två av följande accepterade faciliteter ska erbjudas byggnadens brukare:\na. Accepterade duschar\nb. Accepterade omklädningsrum och klädskåp\nc. Accepterade torkutrymmen för våta kläder \n\nAlternativ 2 - Alternativ 5: \nSE MANUALEN\n","För två poäng ska kraven i ett av följande alternativ vara uppfyllda. \nAlternativ 1\nFörsta poängen \n1. Kontors- och industriprojekt: antalet erbjudna accepterade cykelparkeringar är:\na. 10 % av antalet brukare i byggnaden upp till 500 PLUS\nb. 7 % av antalet brukare i byggnaden i intervallet 501 – 1 000 PLUS\nc. 5 % av antalet brukare i byggnaden över 1 000\n\nDetta under förutsättning att minst 2 cykelparkeringar erbjuds.\n\n2. Handelsprojekt: antalet erbjudna accepterade cykelparkeringar är:\na. 10 % av antalet heltidsarbetande anställda som kommer att pendla till projektet PLUS\nb. 5 % av det totala antalet kundbilparkeringar (ej platser för funktionshindrade eller eventuella familjeplatser). Detta under förutsättning att minst 10 cykelställ finns. Varje projekt med minst 50 cykelparkeringar för kunder kommer att premieras oavsett antalet parkeringsplatser\n\nParkeringar för anställda ska finnas utöver de som finns för kunder, och även om de inte behöver vara åtskilda bör det uppmuntras.\n\nAndra poängen \n1. Första poängen har uppnåtts.\n2. Minst två av följande accepterade faciliteter ska erbjudas byggnadens brukare:\na. Accepterade duschar\nb. Accepterade omklädningsrum och klädskåp\nc. Accepterade torkutrymmen för våta kläder \n\nAlternativ 2 \n1. Under förberedelserna (motsvarande steg b) har projekteringsgruppen samrått med kommunen om det lokala cykelvägnätet och hur projektet kan bidra till dess förbättring.\n2. Ett förslag har valts och genomförts i samråd med kommunen. Detta förslag ska komplettera vad som skulle ha gjorts av kommunen utan stöd från projektet, och det ska ha betydande inverkan på det lokala cykelvägnätet.\n\nAlternativ 3 \n1. Förhandlingar med lokala bussbolag har resulterat i en utökning av linjenätet i projektets närom-råde.\n\nAlternativ 4 \n1. För kontors- och industriprojekt erbjuds laddningsstationer för elbilar motsvarande minst 3 % av byggnadens totala bilparkeringskapacitet.\n2. För handelsprojekt erbjuds laddningsstationer för elbilar för minst följande antal fordon:\na. 3 % av bilparkeringskapaciteten upp till 300 PLUS\nb. 2 % av bilparkeringskapaciteten i intervallet 301 – 1 000 PLUS\nc. 1 % av bilparkeringskapaciteten över 1 000\n3. Elen ska vara 100 % förnybar enligt kraven i Ene 5. \n\nAlternativ 5\n1. Bilpool för samåkning etableras för att uppmuntra och underlätta för byggnadens brukare att registrera sig för samåkning. \n2. Marknadsföringsmaterial har tagits fram för öka medvetenheten om bilpoolen. Materialet kom-mer att kommuniceras till hyresgästerna på lämpligt sätt.\n3. Bilparkeringsplatser för samåkande prioriteras och motsvarar minst 5 % av byggnadens totala bilparkeringskapacitet. \n4. De prioriterade parkeringsplatserna är placerade närmast byggnadens huvudentré\n\nKriterier för exemplarisk nivå\nKriterier för innovationspoängen för denna BREEAM-indikator.\n1. Två av alternativen ovan har implementerats.",{"$f":"$D79","v":"Two credits can be awarded where one of the following measures has been implemented to encourage the use of alternatives to the private car for commuting:\n\nOption 1 – provision of compliant cycle storage spaces according to the number of building users and of compliant facilities including showers, changing facilities and lockers for clothes and drying space for wet clothes\n\nOption 2 – Cooperation with the local authority for the development and implementation of a proposition to improve the local cycling network\n\nOption 3 - Negotiations with local bus companies have resulted in an increase of the local service provision in the development’s local area.\n\nOption 4 – provision of electric recharging stations using electricity from a renewable source\n\nOption 5 – development and implementation of a car sharing platform as well as adequate car parking capacity and spaces\n\n\n\n"},null,null,null,"För två poäng ska kraven i ett av följande alternativ vara uppfyllda.\n\nAlternativ 1\nFörsta poängen \n1. Kontors- och industriprojekt: antalet erbjudna accepterade cykelparkeringar är:\na. 10 % av antalet brukare i byggnaden upp till 500 PLUS\nb. 7 % av antalet brukare i byggnaden i intervallet 501 – 1 000 PLUS\nc. 5 % av antalet brukare i byggnaden över 1 000\nDetta under förutsättning att minst 2 cykelparkeringar erbjuds.\n\n2. Handelsprojekt: antalet erbjudna accepterade cykelparkeringar är:\na. 10 % av antalet heltidsarbetande anställda som kommer att pendla till projektet PLUS\nb. 5 % av det totala antalet kundbilparkeringar (ej platser för funktionshindrade eller eventuella familjeplatser). Detta under förutsättning att minst 10 cykelställ finns. Varje projekt med minst 50 cykelparkeringar för kunder kommer att premieras oavsett antalet parkeringsplatser\n\nParkeringar för anställda ska finnas utöver de som finns för kunder, och även om de inte behöver vara åtskilda bör det uppmuntras.\n\nAndra poängen \n1. Första poängen har uppnåtts.\n2. Minst två av följande accepterade faciliteter ska erbjudas byggnadens brukare:\na. Accepterade duschar\nb. Accepterade omklädningsrum och klädskåp\nc. Accepterade torkutrymmen för våta kläder \n\nAlternativ 2 \n1. Under förberedelserna (motsvarande steg b) har projekteringsgruppen samrått med kommunen om det lokala cykelvägnätet och hur projektet kan bidra till dess förbättring.\n2. Ett förslag har valts och genomförts i samråd med kommunen. Detta förslag ska komplettera vad som skulle ha gjorts av kommunen utan stöd från projektet, och det ska ha betydande inverkan på det lokala cykelvägnätet.\n\n\nAlternativ 3 \n1. Förhandlingar med lokala bussbolag har resulterat i en utökning av linjenätet i projektets närom-råde.\n\nAlternativ 4 \n1. För kontors- och industriprojekt erbjuds laddningsstationer för elbilar motsvarande minst 3 % av byggnadens totala bilparkeringskapacitet.\n2. För handelsprojekt erbjuds laddningsstationer för elbilar för minst följande antal fordon:\na. 3 % av bilparkeringskapaciteten upp till 300 PLUS\nb. 2 % av bilparkeringskapaciteten i intervallet 301 – 1 000 PLUS\nc. 1 % av bilparkeringskapaciteten över 1 000\n3. Elen ska vara 100 % förnybar enligt kraven i Ene 5. \n\nAlternativ 5\n1. Bilpool för samåkning etableras för att uppmuntra och underlätta för byggnadens brukare att registrera sig för samåkning. \n2. Marknadsföringsmaterial har tagits fram för öka medvetenheten om bilpoolen. Materialet kom-mer att kommuniceras till hyresgästerna på lämpligt sätt.\n3. Bilparkeringsplatser för samåkande prioriteras och motsvarar minst 5 % av byggnadens totala bilparkeringskapacitet. \n4. De prioriterade parkeringsplatserna är placerade närmast byggnadens huvudentré\n\nKriterier för exemplarisk nivå\nKriterier för innovationspoängen för denna BREEAM-indikator.\n1. Två av alternativen ovan har implementerats.",{"$f":"$D79","v":"Two credits can be awarded where one of the following measures has been implemented to encourage the use of alternatives to the private car for commuting:\n\nOption 1 – provision of compliant cycle storage spaces according to the number of building users and of compliant facilities including showers, changing facilities and lockers for clothes and drying space for wet clothes\n\nOption 2 – Cooperation with the local authority for the development and implementation of a proposition to improve the local cycling network\n\nOption 3 - Negotiations with local bus companies have resulted in an increase of the local service provision in the development’s local area.\n\nOption 4 – provision of electric recharging stations using electricity from a renewable source\n\nOption 5 – development and implementation of a car sharing platform as well as adequate car parking capacity and spaces\n\n\n\n"},null,{"$f":"IF(HC=\"y\",AE79,+IF(Ret=\"y\",AG79,+IF(OFF=\"y\",AI79,+IF(TOYOTA=\"y\",AU79,+IF(PRISONS=\"y\",AM79,+IF(SCHOOLS=\"y\",AO79,+IF(FE=\"y\",AQ79,+IF(INDUSTRIAL=\"y\",AS79))))))))","v":2},null,null,null,null,0,null,null,null,{"$f":"IF(OR(islike($V79,\"*2*\"),islike($V79,\"*1B*\")),EY79*0.5,EY79)","v":{"$error":"#NAME?"}},{"$f":"IF(OR(islike($V79,\"*2*\"),islike($V79,\"*1B*\")),EZ79*0.5,EZ79)","v":{"$error":"#NAME?"}},{"$f":"IF(OR(islike($V79,\"*2*\"),islike($V79,\"*1B*\")),FA79*0.5,FA79)","v":{"$error":"#NAME?"}},{"$f":"IF(OR(islike($V79,\"*2*\"),islike($V79,\"*1B*\")),FB79*0.5,FB79)","v":{"$error":"#NAME?"}},{"$f":"IF(OR(islike($V79,\"*2*\"),islike($V79,\"*1B*\")),FC79*0.5,FC79)","v":{"$error":"#NAME?"}},null,null,null,null,2,2,2,2,null,null,null,null,null,null,null,null,2,2,2,2,2,null,null,null,1,null,null,null,null,null,null,null,null,null,null,null,null,null,1,"Y",null,1,null,null,null,null,null,null,null,null,1,"Y",null,1,null,null,1,"Y",null,1,null,null,null,null,null,null,null,1,"Y",null,1,null,null,null,null,null,null,null,null,null,null,null,null,null,null,null,null,null,null,null,1,"Y",null,1,null,null,null,null,null,null,null,null,null,null,1,"Y",null,1,null,null,null,null,null,null,null,null,null,null,null,null,null,null,1,"Y",null,null,0,0,0,0,0]
[null,"Tra 4","Säkerhet för gående och cyklister",null,null,"1. Om externa tomtområden ingår i bedömningen, och det på dessa finns tillfartsvägar för fordon, parkering och/eller gångvägar till byggnaden, ska lämpliga cykel- och gångvägar anordnas. Om byggnaden saknar externa områden och åtkomst sker direkt från allmän väg/gångväg, erhålls poängen som default.\n\nKriterier för access med cykel\n2. Cykelbanornas bredd uppfyller följande minimikrav:\na. Om fotgängare och cyklister delar väg, ska dess totala bredd vara minst 3 m.\nb. Om cykelväg är åtskild från både gångväg och bilväg, ska dess bredd vara minst 2 m. \nc. Om cykelväg är en del av en bilväg, ska cykelbanans bredd vara minst 1,5 m.\n3. Cykelvägar ger direkt åtkomst till cykelparkering på tomten utan att cykelvägen behöver lämnas, och om det är relevant ansluter de till cykelbanor utanför området i närheten av projektets gräns. \n4. Områden för varuleveranser varken korsar eller delar cykelvägar.\n5. Belysning på cykelvägar på tomten överensstämmer med SS – EN 13201-2 eller SS-EN 12464-2.\n\nKriterier för access till fots\n6. Gångvägarnas bredd uppfyller följande minimimått:\na. Om fotgängare och cyklister delar väg, ska dess totala bredd vara minst 3 m.\nb. Om gångvägen är skild från både cykelväg och bilväg, ska dess bredd vara minst 1,5 m.\n7. Leveransområden har inte tillfart via parkeringsytor och korsar eller delar inte områden med utefaci-liteter för byggnadens brukare och allmänheten.\n8. Belysning av gångvägar på tomten överensstämmer med nationella riktlinjer för bästa vägbelysning. \n9. Gångvägar på tomten ansluter till allmänna gångvägar utanför tomten som ger åtkomst till lokala transportknutpunkter och andra bekvämligheter utanför tomten (i förekommande fall).\n10. Eventuella avstigningsområden är placerade utanför tillfartsvägarna och har direkt anslutning till gångvägar/ytor så att inte fotgängare behöver korsa vägar med biltrafik.\n11. Om det finns övergångsställen för fotgängare som korsar tillfartsväg för fordonstrafik, höjs vägen till trottoarnivå (det vill säga trottoaren sänks inte ner till vägens nivå).\n12. För större projektet med ett stort antal offentliga brukare/besökare ska gångvägar skyltas till andra lokala bekvämligheter utanför tomten, även till allmänna trafikknutpunkter.","1. Om externa tomtområden ingår i bedömningen, och det på dessa finns tillfartsvägar för fordon, parkering och/eller gångvägar till byggnaden, ska lämpliga cykel- och gångvägar anordnas. Om byggnaden saknar externa områden och åtkomst sker direkt från allmän väg/gångväg, erhålls poängen som default.\n\nKriterier för access med cykel\n2. Cykelbanornas bredd uppfyller följande minimikrav:\na. Om fotgängare och cyklister delar väg, ska dess totala bredd vara minst 3 m.\nb. Om cykelväg är åtskild från både gångväg och bilväg, ska dess bredd vara minst 2 m. \nc. Om cykelväg är en del av en bilväg, ska cykelbanans bredd vara minst 1,5 m.\n3. Cykelvägar ger direkt åtkomst till cykelparkering på tomten utan att cykelvägen behöver lämnas, och om det är relevant ansluter de till cykelbanor utanför området i närheten av projektets gräns. \n4. Områden för varuleveranser varken korsar eller delar cykelvägar.\n5. Belysning på cykelvägar på tomten överensstämmer med SS – EN 13201-2 eller SS-EN 12464-2.\n\nKriterier för access till fots\n6. Gångvägarnas bredd uppfyller följande minimimått:\na. Om fotgängare och cyklister delar väg, ska dess totala bredd vara minst 3 m.\nb. Om gångvägen är skild från både cykelväg och bilväg, ska dess bredd vara minst 1,5 m.\n7. Leveransområden har inte tillfart via parkeringsytor och korsar eller delar inte områden med utefaci-liteter för byggnadens brukare och allmänheten.\n8. Belysning av gångvägar på tomten överensstämmer med nationella riktlinjer för bästa vägbelys-ning. \n9. Gångvägar på tomten ansluter till allmänna gångvägar utanför tomten som ger åtkomst till lokala transportknutpunkter och andra bekvämligheter utanför tomten (i förekommande fall).\n10. Eventuella avstigningsområden är placerade utanför tillfartsvägarna och har direkt anslutning till gångvägar/ytor så att inte fotgängare behöver korsa vägar med biltrafik.\n11. Om det finns övergångsställen för fotgängare som korsar tillfartsväg för fordonstrafik, höjs vägen till trottoarnivå (det vill säga trottoaren sänks inte ner till vägens nivå).\n\n12. För större projektet med ett stort antal offentliga brukare/besökare ska gångvägar skyltas till andra lokala bekvämligheter utanför tomten, även till allmänna trafikknutpunkter.\n\nNotera: För kontors-och industribyggnader, ska alla kriterier vara uppfyllda för att erhålla poäng. \nNotera: För handelsbyggnader kan en poäng erhållas om kriterierna för cykelaccess är uppfyllda, och andra poängen om kriterierna för fotgängaraccess är uppfyllda. Poängen kan erhållas oberoende av varandra, det vill säga en poäng kan erhållas för accepterade gångvägar, även om inte cykelvägarna är accepterade och vice versa. ","One credit where evidence provided demonstrates that the site layout has been designed in accordance with best practice to ensure safe and adequate pedestrian and cycle access.",null,null,null,"1. Om externa tomtområden ingår i bedömningen, och det på dessa finns tillfartsvägar för fordon, parkering och/eller gångvägar till byggnaden, ska lämpliga cykel- och gångvägar anordnas. Om byggnaden saknar externa områden och åtkomst sker direkt från allmän väg/gångväg, erhålls poängen som default.\n\nKriterier för access med cykel\n2. Cykelbanornas bredd uppfyller följande minimikrav:\na. Om fotgängare och cyklister delar väg, ska dess totala bredd vara minst 3 m.\nb. Om cykelväg är åtskild från både gångväg och bilväg, ska dess bredd vara minst 2 m. \nc. Om cykelväg är en del av en bilväg, ska cykelbanans bredd vara minst 1,5 m.\n3. Cykelvägar ger direkt åtkomst till cykelparkering på tomten utan att cykelvägen behöver lämnas, och om det är relevant ansluter de till cykelbanor utanför området i närheten av projektets gräns. \n4. Områden för varuleveranser varken korsar eller delar cykelvägar.\n5. Belysning på cykelvägar på tomten överensstämmer med SS – EN 13201-2 eller SS-EN 12464-2.\n\nKriterier för access till fots\n6. Gångvägarnas bredd uppfyller följande minimimått:\na. Om fotgängare och cyklister delar väg, ska dess totala bredd vara minst 3 m.\nb. Om gångvägen är skild från både cykelväg och bilväg, ska dess bredd vara minst 1,5 m.\n7. Leveransområden har inte tillfart via parkeringsytor och korsar eller delar inte områden med utefaci-liteter för byggnadens brukare och allmänheten.\n8. Belysning av gångvägar på tomten överensstämmer med nationella riktlinjer för bästa vägbelys-ning. \n9. Gångvägar på tomten ansluter till allmänna gångvägar utanför tomten som ger åtkomst till lokala transportknutpunkter och andra bekvämligheter utanför tomten (i förekommande fall).\n10. Eventuella avstigningsområden är placerade utanför tillfartsvägarna och har direkt anslutning till gångvägar/ytor så att inte fotgängare behöver korsa vägar med biltrafik.\n11. Om det finns övergångsställen för fotgängare som korsar tillfartsväg för fordonstrafik, höjs vägen till trottoarnivå (det vill säga trottoaren sänks inte ner till vägens nivå).\n12. För större projektet med ett stort antal offentliga brukare/besökare ska gångvägar skyltas till andra lokala bekvämligheter utanför tomten, även till allmänna trafikknutpunkter.\n\nNotera: För kontors-och industribyggnader, ska alla kriterier vara uppfyllda för att erhålla poäng. \n\nNotera: För handelsbyggnader kan en poäng erhållas om kriterierna för cykelaccess är uppfyllda, och andra poängen om kriterierna för fotgängaraccess är uppfyllda. Poängen kan erhållas oberoende av varandra, det vill säga en poäng kan erhållas för accepterade gångvägar, även om inte cykelvägarna är accepterade och vice versa. ","One credit where evidence provided demonstrates that the site layout has been designed in accordance with best practice to ensure safe and adequate cycle access.\n\nOne credit where evidence provided demonstrates that the site layout has been designed in accordance with best practice to ensure safe and adequate pedestrian access.",null,1,null,null,null,null,0,null,null,null,{"$f":"IF(OR(islike($V80,\"*2*\"),islike($V80,\"*1B*\")),EY80*0.5,EY80)","v":{"$error":"#NAME?"}},{"$f":"IF(OR(islike($V80,\"*2*\"),islike($V80,\"*1B*\")),EZ80*0.5,EZ80)","v":{"$error":"#NAME?"}},{"$f":"IF(OR(islike($V80,\"*2*\"),islike($V80,\"*1B*\")),FA80*0.5,FA80)","v":{"$error":"#NAME?"}},{"$f":"IF(OR(islike($V80,\"*2*\"),islike($V80,\"*1B*\")),FB80*0.5,FB80)","v":{"$error":"#NAME?"}},{"$f":"IF(OR(islike($V80,\"*2*\"),islike($V80,\"*1B*\")),FC80*0.5,FC80)","v":{"$error":"#NAME?"}},null,null,null,null,2,2,1,1,null,null,null,null,null,null,null,null,1,1,2,2,2,null,null,null,null,null,null,null,null,null,null,null,{"$f":"IF(smallhc=\"y\",1,0)","v":0},null,null,null,null,null,{"$f":"SUM(BA80:BN80)","v":0},"N",null,1,null,null,null,null,null,null,null,null,1,"Y",null,1,null,null,1,"Y",null,0,null,null,null,null,null,null,null,0,"N",null,1,null,null,null,null,null,null,null,null,null,null,null,null,null,null,null,null,null,null,null,1,"Y",null,1,null,null,null,null,null,null,null,null,null,null,1,"Y",null,1,null,null,null,null,null,null,null,null,null,null,null,null,null,null,1,"Y",null,null,0,0,0,0,0]
[null,"Tra 4","Pedestrian and cycle safety",null,null,"N/A","N/A","N/A",null,null,null,"N/A","N/A",null,0,null,null,null,null,0,null,null,null,{"$f":"IF(OR(islike($V81,\"*2*\"),islike($V81,\"*1B*\")),EY81*0.5,EY81)","v":{"$error":"#NAME?"}},{"$f":"IF(OR(islike($V81,\"*2*\"),islike($V81,\"*1B*\")),EZ81*0.5,EZ81)","v":{"$error":"#NAME?"}},{"$f":"IF(OR(islike($V81,\"*2*\"),islike($V81,\"*1B*\")),FA81*0.5,FA81)","v":{"$error":"#NAME?"}},{"$f":"IF(OR(islike($V81,\"*2*\"),islike($V81,\"*1B*\")),FB81*0.5,FB81)","v":{"$error":"#NAME?"}},{"$f":"IF(OR(islike($V81,\"*2*\"),islike($V81,\"*1B*\")),FC81*0.5,FC81)","v":{"$error":"#NAME?"}},null,null,null,null,0,2,0,1,null,null,null,null,null,null,null,null,0,1,0,2,null,null,null,null,null,null,null,null,null,null,null,null,null,{"$f":"IF(largehc=\"y\",1,0)","v":0},null,null,null,null,0,"N",null,null,null,null,null,null,null,null,null,null,0,"N",null,0,null,null,0,"N",null,0,null,null,null,null,null,null,null,0,"N",null,0,null,null,null,null,null,null,null,null,null,null,null,null,null,null,null,null,null,null,null,0,"N",null,0,null,null,null,null,null,null,null,null,null,null,0,"N",null,0,null,null,null,null,null,null,null,null,null,null,null,null,null,null,0,"N",null,null,0,0,0,0,0]
[null,"Tra 5","Resplan","One credit where evidence is provided to demonstrate that a travel plan has been developed and tailored to the specific needs of the building users.",null,"Följande krav ska vara uppfyllda\n1. I en förstudie under projekteringsskedet värderas alla resealternativ som är relevanta för byggnadstyp och brukare i en resplan. \n2. Resplanen är formulerad så att den uppfyller projektet behov och den beaktar resultat från en resvaneundersökning som omfattar minst följande:\na. Där det är relevant; aktuellt resmönster och åsikter från byggnadens brukare eller tomtens an-vändare vad avser cykling och promenader för att identifiera begränsningar och möjligheter.\nb.  Resmönster och transporteffekter hos byggnadens framtida brukare \nc. Aktuell lokal miljö för fotgängare och cyklister (även besökande med små barn)\nd. Handikappanpassning (med hänsyn till olika grad av handikapp och synnedsättningar)\ne. Allmänna kommunikationer som betjänar området\nf. Nuvarande faciliteter för cyklister\n\n3. Resplanen inkluderar ett åtgärderspaket som påverkar utformningen av projektet för att uppnå målen i resplanen och minimera bilresorna. Detta kan omfatta åtgärder som: \na. Tillhandahålla prioriterade parkeringsplatser för samåkare  \nb. Tillhandahålla lämpliga och praktiska cykelparkeringar med ombytesfaciliteter\nc. Belysning, utformning av utemiljö och skydd för att göra väntytor för fotgängares och kollektivtrafikresenärers angenäma.\nd. Förhandlingar för att förbättra busservicen, det vill säga ändra busslinjer eller erbjuda rabatter.\ne. Begränsa och/eller ta betalt för bilparkering\nf. Kriterier för lobbyutrymme där lättillgänglig information om kollektivtrafik eller samåkning kan tillhandahållas.\ng. Gång- och cykelvänliga alternativ (för alla typer av användare oavsett grad av rörlighet eller synnedsättning) genom att tillhandahålla cykelbanor, säkra övergångar, raka vägar, lämpliga ytskikt, väl belysta och skyltade om annan service, transportknutpunkter och angränsande gång- och cykelvägar.\nh. Erbjuda lämpliga platser för på- och avstigning för taxi. \ni. Byggnader på landsbygden placeras med lämpliga kommunikationer för att säkerställa att de fungerar med det lokala samhället (till exempel tätortscentra). \n4. Resplanen innehåller skräddarsydda åtgärder för att minimera effekterna av transporter som är nödvändiga för verksamheten, till exempel varuleveranser.","Följande krav ska vara uppfyllda\n1. I en förstudie under projekteringsskedet värderas alla resealternativ som är relevanta för byggnads-typ och brukare i en resplan. \n2. Resplanen är formulerad så att den uppfyller projektet behov och den beaktar resultat från en resvaneundersökning som omfattar minst följande:\na. Där det är relevant; aktuellt resmönster och åsikter från byggnadens brukare eller tomtens användare vad avser cykling och promenader för att identifiera begränsningar och möjligheter.\nb.  Resmönster och transporteffekter hos byggnadens framtida brukare \nc. Aktuell lokal miljö för fotgängare och cyklister (även besökande med små barn)\nd. Handikappanpassning (med hänsyn till olika grad av handikapp och synnedsättningar)\ne. Allmänna kommunikationer som betjänar området\nf. Nuvarande faciliteter för cyklister\n\n3. Resplanen inkluderar ett åtgärderspaket som påverkar utformningen av projektet för att uppnå målen i resplanen och minimera bilresorna. Detta kan omfatta åtgärder som: \na. Tillhandahålla prioriterade parkeringsplatser för samåkare  \nb. Tillhandahålla lämpliga och praktiska cykelparkeringar med ombytesfaciliteter\nc. Belysning, utformning av utemiljö och skydd för att göra väntytor för fotgängares och kollektivtrafikresenärers angenäma.\nd. Förhandlingar för att förbättra busservicen, det vill säga ändra busslinjer eller erbjuda rabatter.\ne. Begränsa och/eller ta betalt för bilparkering\nf. Kriterier för lobbyutrymme där lättillgänglig information om kollektivtrafik eller samåkning kan tillhandahållas.\ng. Gång- och cykelvänliga alternativ (för alla typer av användare oavsett grad av rörlighet eller synnedsättning) genom att tillhandahålla cykelbanor, säkra övergångar, raka vägar, lämpliga ytskikt, väl belysta och skyltade om annan service, transportknutpunkter och angränsande gång- och cykelvägar.\nh. Erbjuda lämpliga platser för på- och avstigning för taxi. \ni. Byggnader på landsbygden placeras med lämpliga kommunikationer för att säkerställa att de fungerar med det lokala samhället (till exempel tätortscentra). \n4. Resplanen innehåller skräddarsydda åtgärder för att minimera effekterna av transporter som är nödvändiga för verksamheten, till exempel varuleveranser.",{"$f":"$D82","v":"One credit where evidence is provided to demonstrate that a travel plan has been developed and tailored to the specific needs of the building users."},null,null,null,"Följande krav ska vara uppfyllda\n1. I en förstudie under projekteringsskedet värderas alla resealternativ som är relevanta för byggnads-typ och brukare i en resplan. \n2. Resplanen är formulerad så att den uppfyller projektet behov och den beaktar resultat från en resvaneundersökning som omfattar minst följande:\na. Där det är relevant; aktuellt resmönster och åsikter från byggnadens brukare eller tomtens an-vändare vad avser cykling och promenader för att identifiera begränsningar och möjligheter.\nb.  Resmönster och transporteffekter hos byggnadens framtida brukare \nc. Aktuell lokal miljö för fotgängare och cyklister (även besökande med små barn)\nd. Handikappanpassning (med hänsyn till olika grad av handikapp och synnedsättningar)\ne. Allmänna kommunikationer som betjänar området\nf. Nuvarande faciliteter för cyklister\n\n3. Resplanen inkluderar ett åtgärderspaket som påverkar utformningen av projektet för att uppnå målen i resplanen och minimera bilresorna. Detta kan omfatta åtgärder som: \na. Tillhandahålla prioriterade parkeringsplatser för samåkare  \nb. Tillhandahålla lämpliga och praktiska cykelparkeringar med ombytesfaciliteter\nc. Belysning, utformning av utemiljö och skydd för att göra väntytor för fotgängares och kollektivtrafikresenärers angenäma.\nd. Förhandlingar för att förbättra busservicen, det vill säga ändra busslinjer eller erbjuda rabatter.\ne. Begränsa och/eller ta betalt för bilparkering\nf. Kriterier för lobbyutrymme där lättillgänglig information om kollektivtrafik eller samåkning kan tillhandahållas.\ng. Gång- och cykelvänliga alternativ (för alla typer av användare oavsett grad av rörlighet eller synnedsättning) genom att tillhandahålla cykelbanor, säkra övergångar, raka vägar, lämpliga ytskikt, väl belysta och skyltade om annan service, transportknutpunkter och angränsande gång- och cykelvägar.\nh. Erbjuda lämpliga platser för på- och avstigning för taxi. \ni. Byggnader på landsbygden placeras med lämpliga kommunikationer för att säkerställa att de fungerar med det lokala samhället (till exempel tätortscentra). \n4. Resplanen innehåller skräddarsydda åtgärder för att minimera effekterna av transporter som är nödvändiga för verksamheten, till exempel varuleveranser.",{"$f":"$D82","v":"One credit where evidence is provided to demonstrate that a travel plan has been developed and tailored to the specific needs of the building users."},null,1,null,null,null,null,0,null,null,null,{"$f":"IF(OR(islike($V82,\"*2*\"),islike($V82,\"*1B*\")),EY82*0.5,EY82)","v":{"$error":"#NAME?"}},{"$f":"IF(OR(islike($V82,\"*2*\"),islike($V82,\"*1B*\")),EZ82*0.5,EZ82)","v":{"$error":"#NAME?"}},{"$f":"IF(OR(islike($V82,\"*2*\"),islike($V82,\"*1B*\")),FA82*0.5,FA82)","v":{"$error":"#NAME?"}},{"$f":"IF(OR(islike($V82,\"*2*\"),islike($V82,\"*1B*\")),FB82*0.5,FB82)","v":{"$error":"#NAME?"}},{"$f":"IF(OR(islike($V82,\"*2*\"),islike($V82,\"*1B*\")),FC82*0.5,FC82)","v":{"$error":"#NAME?"}},null,null,null,null,1,1,1,1,null,null,null,null,null,null,null,null,1,1,1,1,1,null,null,null,1,null,null,null,null,null,null,null,null,null,null,null,null,null,1,"Y",null,1,null,null,null,null,null,null,null,null,1,"Y",null,1,null,null,1,"Y",null,1,null,null,null,null,null,null,null,1,"Y",null,1,null,null,null,null,null,null,null,null,null,null,null,null,null,null,null,null,null,null,null,1,"Y",null,1,null,null,null,null,null,null,null,null,null,null,1,"Y",null,1,null,null,null,null,null,null,null,null,null,null,null,null,null,null,1,"Y",null,null,0,0,0,0,0]
[null,"Tra 6","Maximal bilparkeringskapacitet",null,null,"Följande krav ska vara uppfyllda.\n\nFörsta poängen\n1. Det finns högst en parkeringsplats per tre brukare i byggnaden.\n\nAndra poängen\n1. Det finns högst en parkeringsplats per fyra brukare i byggnaden.","Första poängen\n1. Det finns högst en parkeringsplats per tre brukare i byggnaden.\n\nAndra poängen\n1. Det finns högst en parkeringsplats per fyra brukare i byggnaden.","N/A",null,null,null,"Första poängen\n1. Det finns högst en parkeringsplats per tre brukare i byggnaden.\n\nAndra poängen\n1. Det finns högst en parkeringsplats per fyra brukare i byggnaden.","N/A",null,2,null,null,null,null,0,null,null,null,{"$f":"IF(OR(islike($V83,\"*2*\"),islike($V83,\"*1B*\")),EY83*0.5,EY83)","v":{"$error":"#NAME?"}},{"$f":"IF(OR(islike($V83,\"*2*\"),islike($V83,\"*1B*\")),EZ83*0.5,EZ83)","v":{"$error":"#NAME?"}},{"$f":"IF(OR(islike($V83,\"*2*\"),islike($V83,\"*1B*\")),FA83*0.5,FA83)","v":{"$error":"#NAME?"}},{"$f":"IF(OR(islike($V83,\"*2*\"),islike($V83,\"*1B*\")),FB83*0.5,FB83)","v":{"$error":"#NAME?"}},{"$f":"IF(OR(islike($V83,\"*2*\"),islike($V83,\"*1B*\")),FC83*0.5,FC83)","v":{"$error":"#NAME?"}},null,null,null,null,0,0,2,2,null,null,null,null,null,null,null,null,2,2,0,0,null,null,null,null,1,null,null,null,null,null,null,null,null,null,null,null,null,null,1,"Y",null,1,null,null,null,null,null,null,null,null,1,"Y",null,0,null,null,0,"N",null,0,null,null,null,null,null,null,null,0,"N",null,0,null,null,null,null,null,null,null,null,null,null,null,null,null,null,null,null,null,null,null,0,"N",null,0,null,null,null,null,null,null,null,null,null,null,0,"N",null,1,null,null,null,null,null,null,null,null,null,null,null,null,null,null,1,"Y",null,null,0,0,0,0,0]
[null,"Tra 7","Reseinformations-punkt",null,null,"Följande krav ska vara uppfyllda\n1. Det finns ett informationssystem i realtid för kollektivtrafik så att byggnadens brukare får aktuell transportinformation för sin reseplanering. \n2. Systemet ska placeras i ett tillgängligt och allmänt utrymme och skyltningen är lämplig, både på den aktuella platsen och på andra ställen i byggnaden för att göra brukarna medvetna om att det finns och var det är placerat.","1. Det finns ett informationssystem i realtid för kollektivtrafik så att byggnadens brukare får aktuell transportinformation för sin reseplanering. \n2. Systemet ska placeras i ett tillgängligt och allmänt utrymme och skyltningen är lämplig, både på den aktuella platsen och på andra ställen i byggnaden för att göra brukarna medvetna om att det finns och var det är placerat.","One credit where evidence provided demonstrates there is a dedicated space within the development for the provision of up-to-date public transport and taxi information.",null,null,null,"Följande krav ska vara uppfyllda\n1. Det finns ett informationssystem i realtid för kollektivtrafik så att byggnadens brukare får aktuell transportinformation för sin reseplanering. \n2. Systemet ska placeras i ett tillgängligt och allmänt utrymme och skyltningen är lämplig, både på den aktuella platsen och på andra ställen i byggnaden för att göra brukarna medvetna om att det finns och var det är placerat.","N/A",null,0,null,null,null,null,0,null,null,null,{"$f":"IF(OR(islike($V84,\"*2*\"),islike($V84,\"*1B*\")),EY84*0.5,EY84)","v":{"$error":"#NAME?"}},{"$f":"IF(OR(islike($V84,\"*2*\"),islike($V84,\"*1B*\")),EZ84*0.5,EZ84)","v":{"$error":"#NAME?"}},{"$f":"IF(OR(islike($V84,\"*2*\"),islike($V84,\"*1B*\")),FA84*0.5,FA84)","v":{"$error":"#NAME?"}},{"$f":"IF(OR(islike($V84,\"*2*\"),islike($V84,\"*1B*\")),FB84*0.5,FB84)","v":{"$error":"#NAME?"}},{"$f":"IF(OR(islike($V84,\"*2*\"),islike($V84,\"*1B*\")),FC84*0.5,FC84)","v":{"$error":"#NAME?"}},null,null,null,null,0,1,0,0,null,null,null,null,null,null,null,null,0,0,0,0,null,null,null,null,1,null,null,null,null,null,null,null,null,null,null,null,null,null,1,"Y",null,null,null,null,null,null,null,null,null,null,0,"N",null,1,null,null,1,"Y",null,1,null,null,null,null,null,null,null,1,"Y",null,null,null,null,null,null,null,null,null,null,{"$f":"IF(TOYOTA=\"y\",0,+IF(RETlarge=\"y\",1,0))","v":0},null,null,null,null,null,null,null,null,null,null,0,"N",null,0,null,null,null,null,null,null,null,null,null,null,0,"N",null,0,null,null,null,null,null,null,null,null,null,null,null,null,null,null,0,"N",null,null,0,0,0,0,0]
[null,"Tra 8","Varuleveranser och fordons-manövrering","One credit where evidence provided demonstrates that vehicle access areas have been designed to ensure adequate space for manoeuvring delivery vehicles and provide space away from manoeuvring area for storage of refuse skips and pallets.",null,"1. Platser för parkering och vändzoner är utformade för underlätta manövrering med tanke på de typer av leveransfordon som sannolikt kommer att använda dessa. Syftet är att undvika upprepad justering fram och tillbaka.\n2. Det finns separata parkeringar för väntande leveransfordon, skilda från manöverplats och parke-ringsplatser för anställda/besökare.\n3. Åtkomst till leveransplatser sker inte via parkeringsplatser. De korsar eller delar heller inte gång- och cykelvägar eller andra externa facilitetområden som är tillgängliga för byggnadens brukare och allmänhet.\n4. Platser för avfallscontainrar och lastpallar är separerade från manöverplatser för leveransfordon och bilparkering för anställda/besökare.","1. Platser för parkering och vändzoner är utformade för underlätta manövrering med tanke på de typer av leveransfordon som sannolikt kommer att använda dessa. Syftet är att undvika upprepad justering fram och tillbaka.\n2. Det finns separata parkeringar för väntande leveransfordon, skilda från manöverplats och parke-ringsplatser för anställda/besökare.\n3. Åtkomst till leveransplatser sker inte via parkeringsplatser. De korsar eller delar heller inte gång- och cykelvägar eller andra externa facilitetområden som är tillgängliga för byggnadens brukare och allmänhet.\n4. Platser för avfallscontainrar och lastpallar är separerade från manöverplatser för leveransfordon och bilparkering för anställda/besökare.","N/A",null,null,null,"1. Platser för parkering och vändzoner är utformade för underlätta manövrering med tanke på de typer av leveransfordon som sannolikt kommer att använda dessa. Syftet är att undvika upprepad justering fram och tillbaka.\n2. Det finns separata parkeringar för väntande leveransfordon, skilda från manöverplats och parkeringsplatser för anställda/besökare.\n3. Åtkomst till leveransplatser sker inte via parkeringsplatser. De korsar eller delar heller inte gång- och cykelvägar eller andra externa facilitetområden som är tillgängliga för byggnadens brukare och allmänhet.\n4. Platser för avfallscontainrar och lastpallar är separerade från manöverplatser för leveransfordon och bilparkering för anställda/besökare.",{"$f":"$D85","v":"One credit where evidence provided demonstrates that vehicle access areas have been designed to ensure adequate space for manoeuvring delivery vehicles and provide space away from manoeuvring area for storage of refuse skips and pallets."},null,0,null,null,null,null,0,null,null,null,{"$f":"IF(OR(islike($V85,\"*2*\"),islike($V85,\"*1B*\")),EY85*0.5,EY85)","v":{"$error":"#NAME?"}},{"$f":"IF(OR(islike($V85,\"*2*\"),islike($V85,\"*1B*\")),EZ85*0.5,EZ85)","v":{"$error":"#NAME?"}},{"$f":"IF(OR(islike($V85,\"*2*\"),islike($V85,\"*1B*\")),FA85*0.5,FA85)","v":{"$error":"#NAME?"}},{"$f":"IF(OR(islike($V85,\"*2*\"),islike($V85,\"*1B*\")),FB85*0.5,FB85)","v":{"$error":"#NAME?"}},{"$f":"IF(OR(islike($V85,\"*2*\"),islike($V85,\"*1B*\")),FC85*0.5,FC85)","v":{"$error":"#NAME?"}},null,null,null,null,0,1,0,0,null,null,null,null,null,null,null,null,1,1,0,1,1,null,null,null,1,null,null,null,null,null,null,null,null,null,null,null,null,null,1,"Y",null,null,null,null,null,null,null,null,null,null,0,"N",null,0,null,null,{"$f":"SUM(CD85:CF85)","v":0},"N",null,null,null,null,null,null,null,{"$f":"IF(PRIvehicle=\"y\",1,0)","v":0},null,{"$f":"SUM(CJ85:CQ85)","v":0},"N",null,null,null,null,null,null,null,null,null,null,null,null,null,null,null,{"$f":"IF(RETinternalgoods=\"y\",1,0)","v":0},null,null,null,null,null,0,"N",null,null,null,null,null,null,null,null,null,null,{"$f":"IF(EDUdelivery=\"y\",1,0)","v":0},null,0,"N",null,1,null,null,null,null,null,null,null,null,null,null,null,null,null,null,1,"Y",null,null,0,0,0,0,0]
[null,"Vatten"]
[null,"Wat 1","Vattenförbrukning","Up to three credits where evidence provided demonstrates that the specification includes taps, urinals, WCs and showers that consume less potable water in use than standard specifications for the same type of fittings.",null,"1. Poäng erhålls på följande sätt:\n• Ett poäng då förbrukningen är 4,5 - 5,5 m3 per person och år\n• Två poäng då förbrukningen är 1,5 - 4,4 m3 per person och år \n• Tre poäng då förbrukningen är <1,5 m3 per person och år\n2. För att bestämma vattenförbrukningen i den bedömda byggnaden används begreppet effektiv spolningsvolym. Vattenflödet för följande installerade enheter används som indata till BREEAMs vattenberäkningsverktyg:\na. WC\nb. Urinoar\nc. Tappställe\nd. Dusch\nTappställen i kök, städskrubb och vattenutkastare ingår inte.\n3. Om uppsamling av regnvatten eller gråvatten återanvänds för spolning av WC eller urinoar, ska föl-jande fastställas (om relevant för systemtyp):\na. Platsens årliga nederbörd för (mm) \nb. Regnvattnets avrinningsyta (m2)\nc. Typ av avrinningsyta, till exempel sluttande eller platt tak\nd. Regnvattnets infiltrering\ne. Tankvolym för uppsamlat regnvatten\nf. Procentandel vatten från tappställe inklusive duschar som uppsamlas och används till WC- och urinoarspolning.\ng. Procentandel av byggnadens WC och urinoarer som spolas med gråvatten.","1. Poäng erhålls på följande sätt:\n• Ett poäng då förbrukningen är 4,5 - 5,5 m3 per person och år\n• Två poäng då förbrukningen är 1,5 - 4,4 m3 per person och år \n• Tre poäng då förbrukningen är <1,5 m3 per person och år\n2. För att bestämma vattenförbrukningen i den bedömda byggnaden används begreppet effektiv spolningsvolym. Vattenflödet för följande installerade enheter används som indata till BREEAMs vattenberäkningsverktyg:\na. WC\nb. Urinoar\nc. Tappställe\nd. Dusch\nTappställen i kök, städskrubb och vattenutkastare ingår inte.\n3. Om uppsamling av regnvatten eller gråvatten återanvänds för spolning av WC eller urinoar, ska följande fastställas (om relevant för systemtyp):\na. Platsens årliga nederbörd för (mm) \nb. Regnvattnets avrinningsyta (m2)\nc. Typ av avrinningsyta, till exempel sluttande eller platt tak\nd. Regnvattnets infiltrering\ne. Tankvolym för uppsamlat regnvatten\nf. Procentandel vatten från tappställe inklusive duschar som uppsamlas och används till WC- och urinoarspolning.\ng. Procentandel av byggnadens WC och urinoarer som spolas med gråvatten.",{"$f":"$D87","v":"Up to three credits where evidence provided demonstrates that the specification includes taps, urinals, WCs and showers that consume less potable water in use than standard specifications for the same type of fittings."},null,null,null,"1. Poäng erhålls på följande sätt:\n• Ett poäng då förbrukningen är 4,5 - 5,5 m3 per person och år\n• Två poäng då förbrukningen är 1,5 - 4,4 m3 per person och år \n• Tre poäng då förbrukningen är <1,5 m3 per person och år\n2. För att bestämma vattenförbrukningen i den bedömda byggnaden används begreppet effektiv spolningsvolym. Vattenflödet för följande installerade enheter används som indata till BREEAMs vattenberäkningsverktyg:\na. WC\nb. Urinoar\nc. Tappställe\nd. Dusch\nTappställen i kök, städskrubb och vattenutkastare ingår inte.\n3. Om uppsamling av regnvatten eller gråvatten återanvänds för spolning av WC eller urinoar, ska följande fastställas (om relevant för systemtyp):\na. Platsens årliga nederbörd för (mm) \nb. Regnvattnets avrinningsyta (m2)\nc. Typ av avrinningsyta, till exempel sluttande eller platt tak\nd. Regnvattnets infiltrering\ne. Tankvolym för uppsamlat regnvatten\nf. Procentandel vatten från tappställe inklusive duschar som uppsamlas och används till WC- och urinoarspolning.\ng. Procentandel av byggnadens WC och urinoarer som spolas med gråvatten.",{"$f":"$D87","v":"Up to three credits where evidence provided demonstrates that the specification includes taps, urinals, WCs and showers that consume less potable water in use than standard specifications for the same type of fittings."},null,{"$f":"IF(HC=\"y\",AE87,+IF(Ret=\"y\",AG87,+IF(OFF=\"y\",AI87,+IF(TOYOTA=\"y\",AU87,+IF(PRISONS=\"y\",AM87,+IF(SCHOOLS=\"y\",AO87,+IF(FE=\"y\",AQ87,+IF(INDUSTRIAL=\"y\",AS87))))))))","v":3},null,null,null,null,{"$f":"IF(partnewpartrefurb=\"y\",(Q87*$Q$16)+(R87*$R$16),0)","v":0},null,null,null,{"$f":"IF(OR(islike($V87,\"*2*\"),islike($V87,\"*1B*\")),EY87*0.5,EY87)","v":{"$error":"#NAME?"}},{"$f":"IF(OR(islike($V87,\"*2*\"),islike($V87,\"*1B*\")),EZ87*0.5,EZ87)","v":{"$error":"#NAME?"}},{"$f":"IF(OR(islike($V87,\"*2*\"),islike($V87,\"*1B*\")),FA87*0.5,FA87)","v":{"$error":"#NAME?"}},{"$f":"IF(OR(islike($V87,\"*2*\"),islike($V87,\"*1B*\")),FB87*0.5,FB87)","v":{"$error":"#NAME?"}},{"$f":"IF(OR(islike($V87,\"*2*\"),islike($V87,\"*1B*\")),FC87*0.5,FC87)","v":{"$error":"#NAME?"}},null,null,null,null,{"$f":"IF(DP87=\"y\",AH87,0)","v":3},3,{"$f":"IF(CB87=\"y\",AJ87,0)","v":3},3,null,null,null,null,null,null,null,null,{"$f":"IF(EV87=\"y\",AT87,0)","v":3},3,{"$f":"IF(DP87=\"y\",AV87,0)","v":3},3,3,null,null,null,1,null,null,null,null,null,null,null,null,null,null,null,null,null,1,"Y",null,1,null,null,null,null,null,null,null,null,{"$f":"SUM(BR87:BZ87)","v":1},{"$f":"IF(CA87>=0.1,\"Y\",\"N\")","v":"Y"},null,1,null,null,1,"Y",null,1,null,null,null,null,null,null,null,1,{"$f":"IF(CR87>=0.1,\"Y\",\"N\")","v":"Y"},null,1,null,null,null,null,null,null,null,null,null,null,null,null,null,null,null,null,null,null,null,{"$f":"SUM(CU87:DN87)","v":1},{"$f":"IF(DO87>=0.1,\"Y\",\"N\")","v":"Y"},null,1,null,null,null,null,null,null,null,null,null,null,{"$f":"SUM(DR87:EB87)","v":1},{"$f":"IF(EC87>=0.1,\"Y\",\"N\")","v":"Y"},null,1,null,null,null,null,null,null,null,null,null,null,null,null,null,null,1,{"$f":"IF(EU87>=0.1,\"Y\",\"N\")","v":"Y"},null,null,0,0,1,1,2]
[null,"Wat 2","Vattenmätare","One credit where evidence provided demonstrates that a water meter with a pulsed output will be installed on the mains supply to each building/unit.",null,"1. Vattenmätare ska finnas på vattentillförseln till varje byggnad: detta inkluderar också tillförsel från egen brunn eller annan källa. \n2. Vattenmätare har pulsutgång som möjliggör anslutning till ett styr- och övervakningssystem för kontroll av vattenförbrukningen. \n3. I handelsprojekt med flera enheter, krävs separata vattenmätare med pulsutgång på vattenförsörj-ningen till följande:\na. Uthyrningsytor: vattentillförseln till varje uthyrningsenhet\nb. Gemensamma ytor: vattentillförsel till till exempel toalettgrupper\nc. Serviceytor: vattentillförsel till tappställen på lager, leveransytor, ytor för avfallhantering, etc.\n4. I industriprojekt med flera enheter krävs vattenmätare med pulsutgång till varje enhet.\n5. I byggnader som tillhör, men är åtskilda från huvudbyggnaden, till exempel bensinstation i anknyt-ning till en handelsbyggnad, krävs separata vattenmätare med pulsutgång.\n\nKriterier för exemplarisk nivå\nNedan beskrivs exemplariska nivåer för att uppnå en innovationspoäng i denna BREEAM-indikator:\n1. Det finns separata vattenmätare som tillåter mätning av enskilda vattenförbrukare eller delar i byggnaden, där vattenbehovet är lika med eller större än 10 % av byggnadens totala vattenför-brukning (se även Tolkning av bedömningskriterier)\n2. Varje vattenmätare har pulsutgång som möjliggör anslutning till  byggnadens styr- och övervakningssystem för kontroll av vattenförbrukningen. ","1. Vattenmätare ska finnas på vattentillförseln till varje byggnad: detta inkluderar också tillförsel från egen brunn eller annan källa. \n2. Vattenmätare har pulsutgång som möjliggör anslutning till ett styr- och övervakningssystem för kontroll av vattenförbrukningen. \n3. I handelsprojekt med flera enheter, krävs separata vattenmätare med pulsutgång på vattenförsörj-ningen till följande:\na. Uthyrningsytor: vattentillförseln till varje uthyrningsenhet\nb. Gemensamma ytor: vattentillförsel till till exempel toalettgrupper\nc. Serviceytor: vattentillförsel till tappställen på lager, leveransytor, ytor för avfallhantering, etc.\n4. I industriprojekt med flera enheter krävs vattenmätare med pulsutgång till varje enhet.\n5. I byggnader som tillhör, men är åtskilda från huvudbyggnaden, till exempel bensinstation i anknyt-ning till en handelsbyggnad, krävs separata vattenmätare med pulsutgång.\nKriterier för exemplarisk nivå\nNedan beskrivs exemplariska nivåer för att uppnå en innovationspoäng i denna BREEAM-indikator:\n1. Det finns separata vattenmätare som tillåter mätning av enskilda vattenförbrukare eller delar i byggnaden, där vattenbehovet är lika med eller större än 10 % av byggnadens totala vattenför-brukning (se även Tolkning av bedömningskriterier)\n2. Varje vattenmätare har pulsutgång som möjliggör anslutning till  byggnadens styr- och övervakningssystem för kontroll av vattenförbrukningen. ",{"$f":"$D88","v":"One credit where evidence provided demonstrates that a water meter with a pulsed output will be installed on the mains supply to each building/unit."},null,null,null,"1. Vattenmätare ska finnas på vattentillförseln till varje byggnad: detta inkluderar också tillförsel från egen brunn eller annan källa. \n2. Vattenmätare har pulsutgång som möjliggör anslutning till ett styr- och övervakningssystem för kontroll av vattenförbrukningen. \n3. I handelsprojekt med flera enheter, krävs separata vattenmätare med pulsutgång på vattenförsörjningen till följande:\na. Uthyrningsytor: vattentillförseln till varje uthyrningsenhet\nb. Gemensamma ytor: vattentillförsel till till exempel toalettgrupper\nc. Serviceytor: vattentillförsel till tappställen på lager, leveransytor, ytor för avfallhantering, etc.\n4. I industriprojekt med flera enheter krävs vattenmätare med pulsutgång till varje enhet.\n5. I byggnader som tillhör, men är åtskilda från huvudbyggnaden, till exempel bensinstation i anknytning till en handelsbyggnad, krävs separata vattenmätare med pulsutgång.\n\nKriterier för exemplarisk nivå\nNedan beskrivs exemplariska nivåer för att uppnå en innovationspoäng i denna BREEAM-indikator:\n1. Det finns separata vattenmätare som tillåter mätning av enskilda vattenförbrukare eller delar i byggnaden, där vattenbehovet är lika med eller större än 10 % av byggnadens totala vattenförbrukning (se även Tolkning av bedömningskriterier)\n2. Varje vattenmätare har pulsutgång som möjliggör anslutning till  byggnadens styr- och övervakningssystem för kontroll av vattenförbrukningen. ",{"$f":"$D88","v":"One credit where evidence provided demonstrates that a water meter with a pulsed output will be installed on the mains supply to each building/unit."},null,1,null,null,null,null,0,null,null,null,{"$f":"IF(OR(islike($V88,\"*2*\"),islike($V88,\"*1B*\")),EY88*0.5,EY88)","v":{"$error":"#NAME?"}},{"$f":"IF(OR(islike($V88,\"*2*\"),islike($V88,\"*1B*\")),EZ88*0.5,EZ88)","v":{"$error":"#NAME?"}},{"$f":"IF(OR(islike($V88,\"*2*\"),islike($V88,\"*1B*\")),FA88*0.5,FA88)","v":{"$error":"#NAME?"}},{"$f":"IF(OR(islike($V88,\"*2*\"),islike($V88,\"*1B*\")),FB88*0.5,FB88)","v":{"$error":"#NAME?"}},{"$f":"IF(OR(islike($V88,\"*2*\"),islike($V88,\"*1B*\")),FC88*0.5,FC88)","v":{"$error":"#NAME?"}},null,null,null,null,1,1,1,1,null,null,null,null,null,null,null,null,1,1,1,1,1,null,null,null,1,null,null,null,null,null,null,null,null,null,null,null,null,null,1,"Y",null,1,null,null,null,null,null,null,null,null,1,"Y",null,1,null,null,1,"Y",null,1,null,null,null,null,null,null,null,1,"Y",null,1,null,null,null,null,null,null,null,null,null,null,null,null,null,null,null,null,null,null,null,1,"Y",null,1,null,null,null,null,null,null,null,null,null,null,1,"Y",null,1,null,null,null,null,null,null,null,null,null,null,null,null,null,null,1,"Y",null,null,0,0,0,1,1]
[null,"Wat 3","Detektering av stora vattenläckage","One credit where evidence provided demonstrates that a leak detection system is specified or installed on the building's water supply.",null," 1. Ett system för detektering av stora läckage på vattentillförsel installeras. Systemet ska täcka alla huvudledningar för vattentillförsel inom byggnaden och tomten.\n2.  Systemet för läckdetektering \na. Hörbart när det är aktiverat\nb. Aktiveras när vattenflödet genom vattenmätaren/datorloggen är högre än ett inställt minimi-värde för en förinställd tidsperiod\nc. Kan identifiera olika vattenflöden och då också läckageflöden, till exempel kontinuerlig, högsta och eller lägsta flöde, under inställda tidsperioder\nd. Är programmerbart för att anpassas efter ägarens/brukarens förbrukningsmönster\ne. Om det är möjligt; utformat för att undvika falsklarm vid normal vattenanvändning hos storförbrukare som till exempel kylare."," 1. Ett system för detektering av stora läckage på vattentillförsel installeras. Systemet ska täcka alla huvudledningar för vattentillförsel inom byggnaden och tomten.\n2.  Systemet för läckdetektering \na. Hörbart när det är aktiverat\nb. Aktiveras när vattenflödet genom vattenmätaren/datorloggen är högre än ett inställt minimi-värde för en förinställd tidsperiod\nc. Kan identifiera olika vattenflöden och då också läckageflöden, till exempel kontinuerlig, högsta och eller lägsta flöde, under inställda tidsperioder\nd. Är programmerbart för att anpassas efter ägarens/brukarens förbrukningsmönster\ne. Om det är möjligt; utformat för att undvika falsklarm vid normal vattenanvändning hos storför-brukare som till exempel kylare.",{"$f":"$D89","v":"One credit where evidence provided demonstrates that a leak detection system is specified or installed on the building's water supply."},null,null,null," 1. Ett system för detektering av stora läckage på vattentillförsel installeras. Systemet ska täcka alla huvudledningar för vattentillförsel inom byggnaden och tomten.\n2.  Systemet för läckdetektering \na. Hörbart när det är aktiverat\nb. Aktiveras när vattenflödet genom vattenmätaren/datorloggen är högre än ett inställt minimi-värde för en förinställd tidsperiod\nc. Kan identifiera olika vattenflöden och då också läckageflöden, till exempel kontinuerlig, högsta och eller lägsta flöde, under inställda tidsperioder\nd. Är programmerbart för att anpassas efter ägarens/brukarens förbrukningsmönster\ne. Om det är möjligt; utformat för att undvika falsklarm vid normal vattenanvändning hos storförbrukare som till exempel kylare.",{"$f":"$D89","v":"One credit where evidence provided demonstrates that a leak detection system is specified or installed on the building's water supply."},null,1,null,null,null,null,0,null,null,null,{"$error":"#NAME?"},{"$error":"#NAME?"},{"$error":"#NAME?"},{"$error":"#NAME?"},{"$error":"#NAME?"},null,null,null,null,1,1,1,1,null,null,null,null,null,null,null,null,1,1,1,1,1,null,null,null,1,null,null,null,null,null,null,null,null,null,null,null,null,null,1,"Y",null,1,null,null,null,null,null,null,null,null,1,"Y",null,1,null,null,1,"Y",null,1,null,null,null,null,null,null,null,1,"Y",null,1,null,null,null,null,null,null,null,null,null,null,null,null,null,null,null,null,null,null,null,1,"Y",null,1,null,null,null,null,null,null,null,null,null,null,1,"Y",null,1,null,null,null,null,null,null,null,null,null,null,null,null,null,null,1,"Y",null,null,0,0,0,0,0]
[null,"Wat 4","Avstängning av sanitär vattentillförsel","One credit where evidence provided demonstrates that proximity detection shut-off is\nprovided to the water supply to all toilet areas.",null," 1. Magnetventiler installeras på vattentillförseln till varje toalettområde i byggnaden och styrs av:\n• Infraröda rörelsedetektorer i varje toalettfacilitet \nELLER\n• Sensorer eller brytare placerade vid eller på dörrarna till varje facilitet.","1. Magnetventiler installeras på vattentillförseln till varje toalettområde i byggnaden och styrs av:\n• Infraröda rörelsedetektorer i varje toalettfacilitet \nELLER\n• Sensorer eller brytare placerade vid eller på dörrarna till varje facilitet.",{"$f":"$D90","v":"One credit where evidence provided demonstrates that proximity detection shut-off is\nprovided to the water supply to all toilet areas."},null,null,null,"1. Magnetventiler installeras på vattentillförseln till varje toalettområde i byggnaden och styrs av:\n• Infraröda rörelsedetektorer i varje toalettfacilitet \nELLER\n• Sensorer eller brytare placerade vid eller på dörrarna till varje facilitet.",{"$f":"$D90","v":"One credit where evidence provided demonstrates that proximity detection shut-off is\nprovided to the water supply to all toilet areas."},null,1,null,null,null,null,0,null,null,null,{"$error":"#NAME?"},{"$error":"#NAME?"},{"$error":"#NAME?"},{"$error":"#NAME?"},{"$error":"#NAME?"},null,null,null,null,1,1,1,1,null,null,null,null,null,null,null,null,1,1,1,1,1,null,null,null,1,null,null,null,null,null,null,null,null,null,null,null,null,null,1,"Y",null,1,null,null,null,null,null,null,null,null,1,"Y",null,1,null,null,1,"Y",null,1,null,null,null,null,null,null,null,1,"Y",null,1,null,null,null,null,null,null,null,null,null,null,null,null,null,null,null,null,null,null,null,1,"Y",null,1,null,null,null,null,null,null,null,null,null,null,1,"Y",null,1,null,null,null,null,null,null,null,null,null,null,null,null,null,null,1,"Y",null,null,0,0,0,0,0]
[null,"Wat5","Water recycling ",null,null,"Two credits where evidence provided demonstrates the specification of systems that collect, store and, where necessary treat, rainwater or greywater for WC and urinal flushing purposes.","Two credits where evidence provided demonstrates the specification of systems that collect, store and, where necessary treat, rainwater or greywater for WC and urinal flushing purposes.","One credit where evidence provided demonstrates the specification of systems that collect, store and, where necessary treat, rainwater or greywater for WC and urinal flushing purposes.",null,null,null,"Two credits where evidence provided demonstrates the specification of systems that collect, store and, where necessary treat, rainwater or greywater for WC and urinal flushing purposes.","Two credits where evidence provided demonstrates the specification of systems that collect, store and, where necessary treat, rainwater or greywater for WC and urinal flushing purposes.",null,0,null,null,null,null,0,null,null,null,{"$error":"#NAME?"},{"$error":"#NAME?"},{"$error":"#NAME?"},{"$error":"#NAME?"},{"$error":"#NAME?"},null,null,null,null,0,2,0,0,null,null,null,null,null,null,null,null,0,0,0,2,null,null,null,null,1,null,null,null,null,null,null,null,null,null,null,null,null,null,1,"Y",null,0,null,null,null,null,null,null,null,null,0,"N",null,1,null,null,1,"Y",null,1,null,null,null,null,null,null,null,1,"Y",null,0,null,null,null,null,null,null,null,null,null,null,null,null,null,null,null,null,null,null,null,0,"N",null,1,null,null,null,null,null,null,null,null,null,null,1,"Y",null,0,null,null,null,null,null,null,null,null,null,null,null,null,null,null,0,"N",null,null,0,0,0,0,0]
[null,"Wat 6","Bevattningssystem","One credit where evidence provided demonstrates that a low-water irrigation strategy/system has been installed, or where planting and landscaping is irrigated via rainwater or reclaimed water.",null,"1. Bevattningsmetod för interna eller externa planteringar och/eller anlagda områden uppfyller NÅGON av följande:\na. Dold droppbevattning med jordfuktighetssensor och styrningen av bevattningssystemet är zo-nindelad efter bevattning av planteringstyp.\nb. Återanvändning av vatten från regn- eller gråvattensystem.\nc. Anlagda områden och planteringar utomhus bevattnas endast med nederbörd, oavsett årstid. \nd. Planteringen är begränsad till arter som trivs i det lokala klimatet. \ne. Inget bevattningssystem (inklusive sprinklersystem och slangar) är specificerat, det vill säga planteringen kommer enbart att vattnas manuellt av ägare eller brukarna.\n2. Om det finns system för droppbevattning av markanläggningar utomhus, ska ett styrsystem installeras som är kopplat till en väderstation. Därmed förhindras automatisk bevattning under nederbördsperioder.","1. Bevattningsmetod för interna eller externa planteringar och/eller anlagda områden uppfyller NÅGON av följande:\na. Dold droppbevattning med jordfuktighetssensor och styrningen av bevattningssystemet är zo-nindelad efter bevattning av planteringstyp.\nb. Återanvändning av vatten från regn- eller gråvattensystem.\nc. Anlagda områden och planteringar utomhus bevattnas endast med nederbörd, oavsett årstid. \nd. Planteringen är begränsad till arter som trivs i det lokala klimatet. \ne. Inget bevattningssystem (inklusive sprinklersystem och slangar) är specificerat, det vill säga planteringen kommer enbart att vattnas manuellt av ägare eller brukarna.\n2. Om det finns system för droppbevattning av markanläggningar utomhus, ska ett styrsystem installeras som är kopplat till en väderstation. Därmed förhindras automatisk bevattning under nederbördsperioder.",{"$f":"$D92","v":"One credit where evidence provided demonstrates that a low-water irrigation strategy/system has been installed, or where planting and landscaping is irrigated via rainwater or reclaimed water."},null,null,null,"1. Bevattningsmetod för interna eller externa planteringar och/eller anlagda områden uppfyller NÅGON av följande:\na. Dold droppbevattning med jordfuktighetssensor och styrningen av bevattningssystemet är zonindelad efter bevattning av planteringstyp.\nb. Återanvändning av vatten från regn- eller gråvattensystem.\nc. Anlagda områden och planteringar utomhus bevattnas endast med nederbörd, oavsett årstid. \nd. Planteringen är begränsad till arter som trivs i det lokala klimatet. \ne. Inget bevattningssystem (inklusive sprinklersystem och slangar) är specificerat, det vill säga planteringen kommer enbart att vattnas manuellt av ägare eller brukarna.\n2. Om det finns system för droppbevattning av markanläggningar utomhus, ska ett styrsystem installeras som är kopplat till en väderstation. Därmed förhindras automatisk bevattning under nederbördsperioder.",{"$f":"$D92","v":"One credit where evidence provided demonstrates that a low-water irrigation strategy/system has been installed, or where planting and landscaping is irrigated via rainwater or reclaimed water."},null,1,null,null,null,null,{"$f":"IF(partnewpartrefurb=\"y\",Q92,0)","v":0},null,null,null,{"$error":"#NAME?"},{"$error":"#NAME?"},{"$error":"#NAME?"},{"$error":"#NAME?"},{"$error":"#NAME?"},null,null,null,null,0,1,1,1,null,null,null,null,null,null,null,null,0,1,0,1,1,null,null,null,null,null,null,null,null,null,null,null,null,null,null,null,{"$f":"IF(HCPlanting=\"Y\",1,0)","v":0},null,{"$f":"SUM(BA92:BN92)","v":0},"N",null,null,null,null,null,{"$f":"IF(OFFplanting=\"y\",1,0)","v":1},null,null,null,null,1,"Y",null,null,{"$f":"IF(COURTSplanting=\"Y\",1,0)","v":0},null,0,{"$f":"IF(CG92>=0.1,\"Y\",\"N\")","v":"N"},null,0,null,null,null,null,null,null,null,0,"N",null,null,null,null,null,null,null,null,null,null,null,null,null,null,null,null,null,null,null,null,{"$f":"IF(RETplanting=\"y\",1,0)","v":0},0,"N",null,null,null,null,null,null,null,null,null,null,null,{"$f":"IF(EDUplanting=\"y\",1,0)","v":0},0,"N",null,null,null,null,null,null,null,null,{"$f":"IF(INDplanting=\"y\",1,0)","v":0},null,null,null,null,null,null,null,0,"N",null,null,0,0,0,0,0]
[null,"Wat 7","Biltvätt",null,null," 1. Vatten som faller på och rinner av plattformen i en anläggning för biltvätt, samlas upp och återvinns. Uppsamlingssystemet ska vara helt automatiskt."," 1. Vatten som faller på och rinner av plattformen i en anläggning för biltvätt, samlas upp och åter-vinns. Uppsamlingssystemet ska vara helt automatiskt.","N/A",null,null,null," \n1. Vatten som faller på och rinner av plattformen i en anläggning för biltvätt, samlas upp och åter-vinns. Uppsamlingssystemet ska vara helt automatiskt.","Two credits where evidence provided demonstrates that vehicle washing facilities include a water reclaim system.",null,0,null,null,null,null,0,null,null,null,{"$error":"#NAME?"},{"$error":"#NAME?"},{"$error":"#NAME?"},{"$error":"#NAME?"},{"$error":"#NAME?"},null,null,null,null,0,1,0,0,null,null,null,null,null,null,null,null,0,0,0,2,null,null,null,null,null,null,null,null,null,null,null,null,null,null,null,null,null,null,0,"N",null,null,null,null,null,null,null,null,null,null,0,"N",null,0,null,null,0,"N",null,0,null,null,null,null,null,null,null,0,"N",null,null,null,null,null,null,null,null,null,null,null,null,null,null,null,null,null,null,{"$f":"IF(RETvehiclewash=\"y\",1,0)","v":0},null,null,0,"N",null,0,null,null,null,null,null,null,null,null,null,null,0,"N",null,0,null,null,null,null,null,null,null,null,null,null,null,null,null,null,0,"N",null,null,0,0,0,0,0]
[null,"Wat 8","Bärkraftig lokalhantering av spillvatten","One credit where evidence provided demonstrates that a feasibility study considering sustainable on-site water treatment systems has been carried out and the results implemented. Two credits whre evidence provided demonstrates that the first credit has been achieved and 30% of the building/development's wastewater is treated to tertiary standards",null,"Första poängen\n1. En förstudie har utförts av lämplig rådgivare och bestämmer det mest lämpliga systemet för bärkraftig lokal hantering av spillvatten. Förstudien omfattar minst:\na. Jordtyp\nb. Fall\nc. Elförsörjning\nd. Dålig lukt\ne. Toleransnivå för infiltrering\nf. Tolerans mot belastningsfluktuationer (semester och högsäsong) om relevant\ng. Installationskostnader\nh. Underhåll\ni. Erforderlig area\nj. Vattenkvalitet\nk. Visuell påverkan\n2. Ett system för bärkraftig lokal hantering av spillvatten har specificerats för byggnaden/projektet i linje med rekommendationerna i förstudien ovan.\n3. Förstudien har genomförts i det ”konceptuella designskedet” eller motsvarande. \n\nAndra poängen\n1. Första poängen har uppnåtts.\n2. Ett system för bärkraftig lokal hantering av spillvatten specificeras enligt rekommendationerna i för-studien och EN 12566:2000 - Reningsanläggningar upp till 50 PT som kan behandla minst 30 % av byggnadens/projektets spillvatten till tertiära standarder.\n3. Behandlat vatten filtreras och återanvänds till WC- eller urinoarspolning eller till bevattning.\n4. Projektör eller installatör av systemet ska leverera kompletta underhålls- och driftinstruktioner till byggnadens/tomtens brukare, speciellt med tanke på vattnets kvalitetsnivåer.","Första poängen\n1. En förstudie har utförts av lämplig rådgivare och bestämmer det mest lämpliga systemet för bärkraftig lokal hantering av spillvatten. Förstudien omfattar minst:\na. Jordtyp\nb. Fall\nc. Elförsörjning\nd. Dålig lukt\ne. Toleransnivå för infiltrering\nf. Tolerans mot belastningsfluktuationer (semester och högsäsong) om relevant\ng. Installationskostnader\nh. Underhåll\ni. Erforderlig area\nj. Vattenkvalitet\nk. Visuell påverkan\n2. Ett system för bärkraftig lokal hantering av spillvatten har specificerats för byggnaden/projektet i linje med rekommendationerna i förstudien ovan.\n3. Förstudien har genomförts i det ”konceptuella designskedet” eller motsvarande. \n\nAndra poängen\n1. Första poängen har uppnåtts.\n2. Ett system för bärkraftig lokal hantering av spillvatten specificeras enligt rekommendationerna i för-studien och EN 12566:2000 - Reningsanläggningar upp till 50 PT som kan behandla minst 30 % av byggnadens/projektets spillvatten till tertiära standarder.\n3. Behandlat vatten filtreras och återanvänds till WC- eller urinoarspolning eller till bevattning.\n4. Projektör eller installatör av systemet ska leverera kompletta underhålls- och driftinstruktioner till byggnadens/tomtens brukare, speciellt med tanke på vattnets kvalitetsnivåer.",null,null,null,null,"Första poängen\n1. En förstudie har utförts av lämplig rådgivare och bestämmer det mest lämpliga systemet för bär-kraftig lokal hantering av spillvatten. Förstudien omfattar minst:\na. Jordtyp\nb. Fall\nc. Elförsörjning\nd. Dålig lukt\ne. Toleransnivå för infiltrering\nf. Tolerans mot belastningsfluktuationer (semester och högsäsong) om relevant\ng. Installationskostnader\nh. Underhåll\ni. Erforderlig area\nj. Vattenkvalitet\nk. Visuell påverkan\n2. Ett system för bärkraftig lokal hantering av spillvatten har specificerats för byggnaden/projektet i linje med rekommendationerna i förstudien ovan.\n3. Förstudien har genomförts i det ”konceptuella designskedet” eller motsvarande. \n\nAndra poängen\n1. Första poängen har uppnåtts.\n2. Ett system för bärkraftig lokal hantering av spillvatten specificeras enligt rekommendationerna i för-studien och EN 12566:2000 - Reningsanläggningar upp till 50 PT som kan behandla minst 30 % av byggnadens/projektets spillvatten till tertiära standarder.\n3. Behandlat vatten filtreras och återanvänds till WC- eller urinoarspolning eller till bevattning.\n4. Projektör eller installatör av systemet ska leverera kompletta underhålls- och driftinstruktioner till byggnadens/tomtens brukare, speciellt med tanke på vattnets kvalitetsnivåer.",{"$f":"$D$94","v":"One credit where evidence provided demonstrates that a feasibility study considering sustainable on-site water treatment systems has been carried out and the results implemented. Two credits whre evidence provided demonstrates that the first credit has been achieved and 30% of the building/development's wastewater is treated to tertiary standards"},null,2,null,null,null,null,0,null,null,null,{"$error":"#NAME?"},{"$error":"#NAME?"},{"$error":"#NAME?"},{"$error":"#NAME?"},{"$error":"#NAME?"},null,null,null,null,2,2,2,2,null,null,null,null,null,null,null,null,2,2,2,2,null,null,null,null,null,null,null,null,null,null,null,null,null,null,null,null,null,null,0,"N",null,1,null,null,null,null,null,null,null,null,1,"Y",null,null,null,null,null,null,null,null,null,null,null,null,null,null,null,null,null,null,1,null,null,null,null,null,null,null,null,null,null,null,null,null,null,null,null,null,null,null,1,"Y",null,null,null,null,null,null,null,null,null,null,null,null,null,null,null,1,null,null,null,null,null,null,null,null,null,null,null,null,null,null,1,"Y",null,null,0,0,0,0,0]
[null,"Material"]
[null,"Mat 1","Materialval utifrån livscykelperspektiv","Up to four credits are available where nationally recognised LCA tool or the Green Guide to Specification has been used to evaluate a range of material options for the major building elements",null,"ALTERNATIV 1 – Green Guide\n1. Specifikationer för följande byggnadselement ska bedömas i Green Guide och matas in i BREEAM-assessorns Mat 1 - verktyg. Green Guides betyg för varje byggnadselement finns på  www.thegreenguide.org.uk \n\nALTERNATIV 2 – Andra verktyg\nEn poäng\n1. Värdering av materialalternativ till byggnaden sker med verktyg för så kallad ”Embodied CO2” eller ”Embodied Energy” eller ”Carbon Footprinting”. Projekteringsgruppen kan redovisa hur resultat från verktygen påverkat deras val positivt.\n\nTvå poäng\n2. Ett nationellt accepterat LCA-verktyg används för bedömning av material i byggnadselementen i Tabell 20. Projekteringsgruppen kan visa att bedömningsresultatet har påverkat val av utformning för några av byggnadselementen ovan enligt följande:\n3. Det nationellt accepterade LCA-verktyget har minst följande egenskaper: \na. Minst tre miljöindikatorer inklusive klimatförändring (indikatorerna kan viktas för att få en total-poäng) \nb. Hela byggnadens livscykel bedöms, inklusive livslängd och avfallshantering. \nc. Det baseras på LCA-principer enligt följande internationella standarder:\n• ISO 14040:2006 Miljöledning - Livscykelanalys - Principer och struktur \n• ISO 14044:2006 Miljöledning - Livscykelanalys - Krav och vägledning\n• ISO 14025:2010 Miljömärkning och miljödeklarationer - Typ III Miljödeklarationer - Principer och rutiner\n• ISO 21930:2007 Byggnadskonstruktion - Hållbarhet i byggnadskonstruktion - Miljö-deklaration för byggmaterial \n\nSe Tolkning av bedömningskriterier för godkända LCA-verktyg \n\nObservera att dessa poäng är inte är beroende av att de tidigare poängen erhållits.\n\n\nKriterier för exemplarisk nivå \nNedan beskrivs kriterier för exemplarisk nivå som ger en innovationspoäng i denna BREEAM-indikator.\n\nEtt BREEAM-poäng kan delas ut enligt följande för exemplarisk nivå :\n\nALTERNATIV 1 – Green Guide \na. Om fyra eller fler byggnadselement bedöms, erhåller byggnaden minst två byggnadselements-poäng utöver det totala antal som krävs för att få maximalt antal BREEAM-poäng enligt kriteri-erna. Om färre än fyra byggelement bedöms, erhåller byggnaden minst ett byggnadselements-poäng utöver det totala antalet som krävs för att få maximalt antal BREEAM-poäng enligt krite-rier.\n\nALTERNATIV 2 – Andra verktyg för materialbedömning \na. Projekteringsgruppen använder ett accepterat nationellt LCA-verktyg med funktioner som ovan, för bedömning av material i byggnaden OCH det kan visas att resultatet har påverkat val av ut-formning av alla byggnadselement. ","ALTERNATIV 1 – Green Guide\n1. Specifikationer för följande byggnadselement ska bedömas i Green Guide och matas in i BREEAM-assessorns Mat 1 - verktyg. Green Guides betyg för varje byggnadselement finns på  www.thegreenguide.org.uk \n\nALTERNATIV 2 – Andra verktyg\n\nEn poäng\n1. Värdering av materialalternativ till byggnaden sker med verktyg för så kallad ”Embodied CO2” eller ”Embodied Energy” eller ”Carbon Footprinting”. Projekteringsgruppen kan redovisa hur resultat från verktygen påverkat deras val positivt.\n\nTvå poäng\n2. Ett nationellt accepterat LCA-verktyg används för bedömning av material i byggnadselementen i Tabell 20. Projekteringsgruppen kan visa att bedömningsresultatet har påverkat val av utformning för några av byggnadselementen ovan enligt följande:\n3. Det nationellt accepterade LCA-verktyget har minst följande egenskaper: \na. Minst tre miljöindikatorer inklusive klimatförändring (indikatorerna kan viktas för att få en totalpoäng) \nb. Hela byggnadens livscykel bedöms, inklusive livslängd och avfallshantering. \nc. Det baseras på LCA-principer enligt följande internationella standarder:\n• ISO 14040:2006 Miljöledning - Livscykelanalys - Principer och struktur \n• ISO 14044:2006 Miljöledning - Livscykelanalys - Krav och vägledning\n• ISO 14025:2010 Miljömärkning och miljödeklarationer - Typ III Miljödeklarationer - Principer och rutiner\n• ISO 21930:2007 Byggnadskonstruktion - Hållbarhet i byggnadskonstruktion - Miljö-deklaration för byggmaterial \n\nSe Tolkning av bedömningskriterier för godkända LCA-verktyg \n\nObservera att dessa poäng är inte är beroende av att de tidigare poängen erhållits.\n\n\nKriterier för exemplarisk nivå \nNedan beskrivs kriterier för exemplarisk nivå som ger en innovationspoäng i denna BREEAM-indikator.\n\nEtt BREEAM-poäng kan delas ut enligt följande för exemplarisk nivå :\n\nALTERNATIV 1 – Green Guide \na. Om fyra eller fler byggnadselement bedöms, erhåller byggnaden minst två byggnadselements-poäng utöver det totala antal som krävs för att få maximalt antal BREEAM-poäng enligt kriteri-erna. Om färre än fyra byggelement bedöms, erhåller byggnaden minst ett byggnadselements-poäng utöver det totala antalet som krävs för att få maximalt antal BREEAM-poäng enligt krite-rier.\n\nALTERNATIV 2 – Andra verktyg för materialbedömning \na. Projekteringsgruppen använder ett accepterat nationellt LCA-verktyg med funktioner som ovan, för bedömning av material i byggnaden OCH det kan visas att resultatet har påverkat val av ut-formning av alla byggnadselement. ","Up to six credits are available, determined by the Green Guide to Specification\nratings for the major building/finishing elements.",null,null,null,"ALTERNATIV 1 – Green Guide\n1. Specifikationer för följande byggnadselement ska bedömas i Green Guide och matas in i BREEAM-assessorns Mat 1 - verktyg. Green Guides betyg för varje byggnadselement finns på  www.thegreenguide.org.uk \n\nALTERNATIV 2 – Andra verktyg\nEn poäng\n1. Värdering av materialalternativ till byggnaden sker med verktyg för så kallad ”Embodied CO2” eller ”Embodied Energy” eller ”Carbon Footprinting”. Projekteringsgruppen kan redovisa hur resultat från verktygen påverkat deras val positivt.\n\nTvå poäng\n2. Ett nationellt accepterat LCA-verktyg används för bedömning av material i byggnadselementen i Tabell 20. Projekteringsgruppen kan visa att bedömningsresultatet har påverkat val av utformning för några av byggnadselementen ovan enligt följande:\n3. Det nationellt accepterade LCA-verktyget har minst följande egenskaper: \na. Minst tre miljöindikatorer inklusive klimatförändring (indikatorerna kan viktas för att få en totalpoäng) \nb. Hela byggnadens livscykel bedöms, inklusive livslängd och avfallshantering. \nc. Det baseras på LCA-principer enligt följande internationella standarder:\n• ISO 14040:2006 Miljöledning - Livscykelanalys - Principer och struktur \n• ISO 14044:2006 Miljöledning - Livscykelanalys - Krav och vägledning\n• ISO 14025:2010 Miljömärkning och miljödeklarationer - Typ III Miljödeklarationer - Principer och rutiner\n• ISO 21930:2007 Byggnadskonstruktion - Hållbarhet i byggnadskonstruktion - Miljödeklaration för byggmaterial \n\nSe Tolkning av bedömningskriterier för godkända LCA-verktyg \n\nObservera att dessa poäng är inte är beroende av att de tidigare poängen erhållits.\n\nKriterier för exemplarisk nivå \nNedan beskrivs kriterier för exemplarisk nivå som ger en innovationspoäng i denna BREEAM-indikator.\n\nEtt BREEAM-poäng kan delas ut enligt följande för exemplarisk nivå :\n\nALTERNATIV 1 – Green Guide \na. Om fyra eller fler byggnadselement bedöms, erhåller byggnaden minst två byggnadselementspoäng utöver det totala antal som krävs för att få maximalt antal BREEAM-poäng enligt kriteri-erna. Om färre än fyra byggelement bedöms, erhåller byggnaden minst ett byggnadselementspoäng utöver det totala antalet som krävs för att få maximalt antal BREEAM-poäng enligt kriterier.\n\nALTERNATIV 2 – Andra verktyg för materialbedömning \na. Projekteringsgruppen använder ett accepterat nationellt LCA-verktyg med funktioner som ovan, för bedömning av material i byggnaden OCH det kan visas att resultatet har påverkat val av ut-formning av alla byggnadselement. ",{"$f":"$D$96","v":"Up to four credits are available where nationally recognised LCA tool or the Green Guide to Specification has been used to evaluate a range of material options for the major building elements"},null,{"$f":"IF(HC=\"y\",AE96,+IF(Ret=\"y\",AG96,+IF(OFF=\"y\",AI96,+IF(TOYOTA=\"y\",AU96,+IF(PRISONS=\"y\",AM96,+IF(SCHOOLS=\"y\",AO96,+IF(FE=\"y\",AQ96,+IF(INDUSTRIAL=\"y\",AS96))))))))","v":0},null,null,null,null,{"$f":"IF(partnewpartrefurb=\"y\",Q96,0)","v":0},null,null,null,{"$f":"IF(OR(islike($V96,\"*2*\"),islike($V96,\"*1B*\")),EY96*0.5,EY96)","v":{"$error":"#NAME?"}},{"$f":"IF(OR(islike($V96,\"*2*\"),islike($V96,\"*1B*\")),EZ96*0.5,EZ96)","v":{"$error":"#NAME?"}},{"$f":"IF(OR(islike($V96,\"*2*\"),islike($V96,\"*1B*\")),FA96*0.5,FA96)","v":{"$error":"#NAME?"}},{"$f":"IF(OR(islike($V96,\"*2*\"),islike($V96,\"*1B*\")),FB96*0.5,FB96)","v":{"$error":"#NAME?"}},{"$f":"IF(OR(islike($V96,\"*2*\"),islike($V96,\"*1B*\")),FC96*0.5,FC96)","v":{"$error":"#NAME?"}},null,null,null,null,{"$f":"IF(DP96=\"y\",AH96,0)","v":4},4,{"$f":"IF(CB96=\"y\",AJ96,0)","v":0},4,null,null,null,null,null,null,null,null,{"$f":"IF(EV96=\"y\",AT96,0)","v":0},2,{"$f":"IF(DP96=\"y\",AV96,0)","v":4},4,null,null,null,null,1,null,null,null,null,null,null,null,null,null,null,null,null,null,1,"Y",null,null,{"$f":"IF(Offnewrefurb=\"y\",1,0)","v":0},null,null,null,null,null,null,null,0,"N",null,1,null,null,1,"Y",null,1,null,null,null,null,null,null,null,1,"Y",null,4,{"$f":"IF(RETnewrefurb=\"y\",1,0)","v":0},null,null,null,null,null,null,null,null,null,null,null,null,null,null,null,null,null,null,4,"Y",null,1,null,null,null,null,null,null,null,null,null,null,{"$f":"SUM(DR96:EB96)","v":1},"Y",null,null,{"$f":"IF(INDnewrefurb=\"y\",1,0)","v":0},null,null,null,null,null,null,null,null,null,null,null,null,null,0,"N",null,null,0,0,0,0,0]
[null,"Mat 1","Materialval utifrån livscykelperspektiv - endast inredning","Up to two credits are available where nationally recognised LCA tool or the Green Guide to Specification has been used to evaluate a range of material options for the major building elements",null,"Upp till fyra poäng om ett nationellt erkänt LCA-verktyg används eller att Green Guide nyttjas för projektet","Upp till fyra poäng om ett nationellt erkänt LCA-verktyg används eller att Green Guide nyttjas för projektet","N/A",null,null,null,"Upp till två poäng om ett nationellt erkänt LCA-verktyg används eller att Green Guide nyttjas för projektet",{"$f":"$D$97","v":"Up to two credits are available where nationally recognised LCA tool or the Green Guide to Specification has been used to evaluate a range of material options for the major building elements"},null,2,null,null,null,null,{"$f":"IF(partnewpartrefurb=\"y\",Q97,0)","v":0},null,null,null,{"$error":"#NAME?"},{"$error":"#NAME?"},{"$error":"#NAME?"},{"$error":"#NAME?"},{"$error":"#NAME?"},null,null,null,null,0,2,2,2,null,null,null,null,null,null,null,null,0,2,0,2,null,null,null,null,null,null,null,null,null,null,null,null,null,null,null,null,null,null,{"$f":"SUM(BA97:BN97)","v":0},"N",null,null,null,{"$f":"IF(OFFfitout=\"y\",1,0)","v":1},null,null,null,null,null,null,1,"Y",null,0,null,null,0,"N",null,0,null,null,null,null,null,null,null,0,"N",null,null,null,null,null,null,null,null,null,null,null,null,null,null,null,null,null,null,null,null,null,0,"N",null,0,null,null,null,null,null,null,null,null,null,null,0,"N",null,null,null,{"$f":"IF(INDfitout=\"y\",1,0)","v":0},null,null,null,null,null,null,null,null,null,null,null,null,0,"N",null,null,0,0,0,0,0]
[null,"Mat 2","Hårdgjorda ytor och gränsskydd utomhus","One credit where evidence provided demonstrates that a nationally recognised LCA tool or the Green Guide to Specification has been used to evaluate a range of material options for the external hard landscaping and boundary protection specifications",null,"ALTERNATIV 1 – Green Guide\n1. Minst 80 % av alla hårdgjorda ytor och gränsskydd utomhus (area) uppnår betyget A eller A+ i Green Guide. \nGreen Guide finns på: www.thegreenguide.org.uk och används för betyg på byggnadselement\n\nALTERNATIV 2 – Andra verktyg\n1. Ett accepterat nationellt verktyg för Life Cycle Analysis (LCA) används för värdering och analys av materialalternativ för hårdgjorda ytor och gränsskydd utomhus.\n2. Projekteringsgruppen ska visa hur analysen påverkat utformningen positivt.\n3. Det nationellt accepterade LCA-verktyget som används har minst följande funktioner: \na. Minst tre miljöindikatorer inklusive klimatförändring (indikatorerna kan viktas för totalpoäng)\nb.  Hela byggnadens livscykel bedöms, inklusive livslängd och avfallshantering\nc. Den baseras på LCA-principer enligt följande internationella standarder\n• ISO 14040 2006 Miljöledning - Livscykelanalys - Principer och struktur\n• ISO 14044:2006 Miljöledning - Livscykelanalys - Krav och vägledning\n• ISO 14025:2010 Miljömärkning och miljödeklarationer - Typ III miljödeklarationer - Principer och rutiner\n• ISO 21930 2006 Byggnadskonstruktion - Hållbarhet i byggnadskonstruktion - Miljödeklarat-ion för byggmateria\nSe Tolkning av bedömningskriterier för lista med godkända LCA-verktyg ","ALTERNATIV 1 – Green Guide\n1. Minst 80 % av alla hårdgjorda ytor och gränsskydd utomhus (area) uppnår betyget A eller A+ i Green Guide. \nGreen Guide finns på: www.thegreenguide.org.uk och används för betyg på byggnadselement\n\nALTERNATIV 2 – Andra verktyg\n1. Ett accepterat nationellt verktyg för Life Cycle Analysis (LCA) används för värdering och analys av materialalternativ för hårdgjorda ytor och gränsskydd utomhus.\n2. Projekteringsgruppen ska visa hur analysen påverkat utformningen positivt.\n3. Det nationellt accepterade LCA-verktyget som används har minst följande funktioner: \na. Minst tre miljöindikatorer inklusive klimatförändring (indikatorerna kan viktas för totalpoäng)\nb.  Hela byggnadens livscykel bedöms, inklusive livslängd och avfallshantering\nc. Den baseras på LCA-principer enligt följande internationella standarder\n• ISO 14040 2006 Miljöledning - Livscykelanalys - Principer och struktur\n• ISO 14044:2006 Miljöledning - Livscykelanalys - Krav och vägledning\n• ISO 14025:2010 Miljömärkning och miljödeklarationer - Typ III miljödeklarationer - Principer och rutiner\n• ISO 21930 2006 Byggnadskonstruktion - Hållbarhet i byggnadskonstruktion - Miljödeklaration för byggmateria\nSe Tolkning av bedömningskriterier för lista med godkända LCA-verktyg ",{"$f":"$D98","v":"One credit where evidence provided demonstrates that a nationally recognised LCA tool or the Green Guide to Specification has been used to evaluate a range of material options for the external hard landscaping and boundary protection specifications"},null,null,null,"ALTERNATIV 1 – Green Guide\n1. Minst 80 % av alla hårdgjorda ytor och gränsskydd utomhus (area) uppnår betyget A eller A+ i Green Guide. \nGreen Guide finns på: www.thegreenguide.org.uk och används för betyg på byggnadselement\n\nALTERNATIV 2 – Andra verktyg\n1. Ett accepterat nationellt verktyg för Life Cycle Analysis (LCA) används för värdering och analys av materialalternativ för hårdgjorda ytor och gränsskydd utomhus.\n2. Projekteringsgruppen ska visa hur analysen påverkat utformningen positivt.\n3. Det nationellt accepterade LCA-verktyget som används har minst följande funktioner: \na. Minst tre miljöindikatorer inklusive klimatförändring (indikatorerna kan viktas för totalpoäng)\nb.  Hela byggnadens livscykel bedöms, inklusive livslängd och avfallshantering\nc. Den baseras på LCA-principer enligt följande internationella standarder\n• ISO 14040 2006 Miljöledning - Livscykelanalys - Principer och struktur\n• ISO 14044:2006 Miljöledning - Livscykelanalys - Krav och vägledning\n• ISO 14025:2010 Miljömärkning och miljödeklarationer - Typ III miljödeklarationer - Principer och rutiner\n• ISO 21930 2006 Byggnadskonstruktion - Hållbarhet i byggnadskonstruktion - Miljödeklaration för byggmateria\nSe Tolkning av bedömningskriterier för lista med godkända LCA-verktyg ",{"$f":"$D98","v":"One credit where evidence provided demonstrates that a nationally recognised LCA tool or the Green Guide to Specification has been used to evaluate a range of material options for the external hard landscaping and boundary protection specifications"},null,0,null,null,null,null,0,null,null,null,{"$error":"#NAME?"},{"$error":"#NAME?"},{"$error":"#NAME?"},{"$error":"#NAME?"},{"$error":"#NAME?"},null,null,null,null,0,1,0,1,null,null,null,null,null,null,null,null,0,1,0,1,null,null,null,null,1,null,null,null,null,null,null,null,null,null,null,null,null,null,1,"Y",null,null,{"$f":"IF(Offnewrefurb=\"y\",1,0)","v":0},null,null,null,null,null,null,null,0,"N",null,1,null,null,1,"Y",null,1,null,null,null,null,null,null,null,1,"Y",null,null,{"$f":"IF(RETnewrefurb=\"y\",1,0)","v":0},null,null,null,null,null,null,null,null,null,null,null,null,null,null,null,null,null,null,0,"N",null,1,null,null,null,null,null,null,null,null,null,null,1,"Y",null,null,{"$f":"IF(INDnewrefurb=\"y\",1,0)","v":0},null,null,null,null,null,null,null,null,null,null,null,null,null,0,"N",null,null,0,0,0,0,0]
[null,"Mat 3","Återanvändning av fasader","One credit is awarded where evidence provided demonstrates that at least 50% of the total façade (by area) is reused and at least 80% of the reused façade (by mass) comprises in-situ reused material.",null,"1. Minst 50 % av byggnadens totala fasad (area) är återanvänd.\n2. Minst 80 % av återanvänd fasad (vikt) består av material återanvänt från platsen.","1. Minst 50 % av byggnadens totala fasad (area) är återanvänd.\n2. Minst 80 % av återanvänd fasad (vikt) består av material återanvänt från platsen.",{"$f":"$D99","v":"One credit is awarded where evidence provided demonstrates that at least 50% of the total façade (by area) is reused and at least 80% of the reused façade (by mass) comprises in-situ reused material."},null,null,null,"1. Minst 50 % av byggnadens totala fasad (area) är återanvänd.\n2. Minst 80 % av återanvänd fasad (vikt) består av material återanvänt från platsen.",{"$f":"$D99","v":"One credit is awarded where evidence provided demonstrates that at least 50% of the total façade (by area) is reused and at least 80% of the reused façade (by mass) comprises in-situ reused material."},null,0,null,null,null,null,0,null,null,null,{"$error":"#NAME?"},{"$error":"#NAME?"},{"$error":"#NAME?"},{"$error":"#NAME?"},{"$error":"#NAME?"},null,null,null,null,0,1,0,1,null,null,null,null,null,null,null,null,0,1,0,1,null,null,null,null,1,null,null,null,null,null,null,null,null,null,null,null,null,null,1,"Y",null,null,{"$f":"IF(Offnewrefurb=\"y\",1,0)","v":0},null,null,null,null,null,null,null,0,"N",null,1,null,null,1,"Y",null,1,null,null,null,null,null,null,null,1,"Y",null,null,{"$f":"IF(RETnewrefurb=\"y\",1,0)","v":0},null,null,null,null,null,null,null,null,null,null,null,null,null,null,null,null,null,null,0,"N",null,1,null,null,null,null,null,null,null,null,null,null,1,"Y",null,null,{"$f":"IF(INDnewrefurb=\"y\",1,0)","v":0},null,null,null,null,null,null,null,null,null,null,null,null,null,0,"N",null,null,0,0,0,0,0]
[null,"Mat 4","Återanvändning av byggnadsstomme","One credit is awarded where evidence provided demonstrates that a design reuses at least 80% of an existing primary structure and for part refurbishment and part new build, the volume of the reused structure comprises at least 50% of the final structure’s volume.",null,"1. Minst 80 % av befintlig byggnadsstomme (volym) återanvänds utan omfattande förstärkningsarbete eller ändringar.\n2. Vid delvis ombyggnad och delvis nybyggnad, utgör återanvänd byggnadsstomme minst 50 % av den slutliga byggnadens volym. Det betyder att en eventuell tillbyggnad, inte kan vara större än den befintliga byggnaden för att kvalificera sig för poäng.","1. Minst 80 % av befintlig byggnadsstomme (volym) återanvänds utan omfattande förstärkningsarbete eller ändringar.\n2. Vid delvis ombyggnad och delvis nybyggnad, utgör återanvänd byggnadsstomme minst 50 % av den slutliga byggnadens volym. Det betyder att en eventuell tillbyggnad, inte kan vara större än den befintliga byggnaden för att kvalificera sig för poäng.",{"$f":"$D100","v":"One credit is awarded where evidence provided demonstrates that a design reuses at least 80% of an existing primary structure and for part refurbishment and part new build, the volume of the reused structure comprises at least 50% of the final structure’s volume."},null,null,null,"1. Minst 80 % av befintlig byggnadsstomme (volym) återanvänds utan omfattande förstärkningsarbete eller ändringar.\n2. Vid delvis ombyggnad och delvis nybyggnad, utgör återanvänd byggnadsstomme minst 50 % av den slutliga byggnadens volym. Det betyder att en eventuell tillbyggnad, inte kan vara större än den befintliga byggnaden för att kvalificera sig för poäng.",{"$f":"$D100","v":"One credit is awarded where evidence provided demonstrates that a design reuses at least 80% of an existing primary structure and for part refurbishment and part new build, the volume of the reused structure comprises at least 50% of the final structure’s volume."},null,0,null,null,null,null,0,null,null,null,{"$error":"#NAME?"},{"$error":"#NAME?"},{"$error":"#NAME?"},{"$error":"#NAME?"},{"$error":"#NAME?"},null,null,null,null,0,1,0,1,null,null,null,null,null,null,null,null,0,1,0,1,null,null,null,null,1,null,null,null,null,null,null,null,null,null,null,null,null,null,1,"Y",null,null,{"$f":"IF(Offnewrefurb=\"y\",1,0)","v":0},null,null,null,null,null,null,null,0,"N",null,1,null,null,1,"Y",null,1,null,null,null,null,null,null,null,1,"Y",null,null,{"$f":"IF(RETnewrefurb=\"y\",1,0)","v":0},null,null,null,null,null,null,null,null,null,null,null,null,null,null,null,null,null,null,0,"N",null,1,null,null,null,null,null,null,null,null,null,null,1,"Y",null,null,{"$f":"IF(INDnewrefurb=\"y\",1,0)","v":0},null,null,null,null,null,null,null,null,null,null,null,null,null,0,"N",null,null,0,0,0,0,0]
[null,"Mat 5","Materialval utifrån ansvarsfull tillverkning och utvinning","Up to 3 credits are available where evidence provided demonstrates that 80% of\nthe assessed materials in the following building elements are responsibly\nsourced:\na. Structural Frame\nb. Ground floor\nc. Upper floors (including separating floors)\nd. Roof\ne. External walls\nf. Internal walls\ng. Foundation/substructure\nh. Staircase\n\nAdditionally 100% of any timber must be legally sourced.",null,"Bedömning av nybyggnad och större ombyggnad\n1. Upp till tre poäng kan erhållas om det finns bevis för att 80 % av relevanta material (se listan nedan) i vart och ett av följande byggnadselement, är anskaffade på ett ansvarsfullt sätt:\na. Byggnadsstomme \nb. Grund\nc. Mellanbjälklag\nd. Yttertak\ne. Ytterväggar\nf. Innerväggar\ng. Fundament/grundkonstruktion\nh. Trapphus\n\nRelevanta material\n• Mursten (inklusive tegel, klinker och andra keramiska)\n• Hartsbaserade material och metallkeramiska kompositer, inklusive glasfiberförstärkt plast och polymerputs\n• Betong (inklusive platsgjuten och prefabricerad, betongblock, keramik, murbruk, cementbaserad puts osv)\n• Glas\n• Plast och gummi (inklusive takmembran av EPDM, TPO, PVC och VET inklusive polymerputs)\n• Metaller (stål, aluminium etc)\n• Natursten, byggnadssten och skiffer\n• Trävirke, träkomposit och träpaneler (inklusive limträ, plywood, OSB, MDF, spånskivor och ce-mentbundna spånskivor)\n• Gipsskivor och gips\n• Bituminösa material, såsom taktäckningsmembran och asfalt\n• Andra mineralbaserade material, inklusive fibercement och kalciumsilikat\n• Produkter med återvunnet material\n\nObservera att isoleringsmaterial, infästningar, lim och tillsatser undantas från bedömning. Vad gäller alla andra material som utgör en del av ett relevant byggnadselement och som saknas i listan, kontak-tas SGBC för identifiering av relevanta nyckel- och leveransprocesser.\n\n2. Varje relevant material bedöms utifrån den certifieringsnivå och omfattning som materialleverantör eller tillverkare har uppnått, se Ytterligare information; Tabell 21 Ansvarsfull inköp, nivåer och krite-rier och Tabell 22 EMS-kriterier.\n3. Använd verktyget för ansvarsfulla inköp och följ beräkningsmetoden som redovisas i Ytterligare in-formation för bestämning av antalet erhållna poäng.\n4. Eventuellt icke-certifierat trävirke som används och som kommer från godkänd producent, ingår inte i CITES-listan (se definition för trävirke avverkat på lagligt sätt).\n\nBedömning av endast inredning\n1. Upp till två poäng kan erhållas om bevis presenteras på att 80 % av relevanta material (se listan nedan), i följande inredningselement, är inköpta på ett ansvarsfullt sätt:\na. Trappor\nb. Fönster\nc. Utvändiga och invändiga dörrar\nd. Golvlister\ne. Panel\nf. Inventarier\ng. Lister\nh. All annan betydande användning\n\nRelevanta material\n• Mursten (inklusive tegel, klinker och annan keramik)\n• Hartsbaserade material och metallkeramiska kompositer, inklusive glasfiberförstärkt plast och po-lymerputs \n• Betong (inklusive platsgjuten och prefabricerad, betongblock, keramik, murbruk, cementbaserad puts osv)\n• Glas\n• Plast och gummi (inklusive takmembran av EPDM, TPO, PVC och VET inklusive polymerputs)\n• Metaller (stål, aluminium etc)\n• Natursten, byggnadssten och skiffer\n• Trävirke, träkomposit och träpaneler (inklusive limträ, plywood, OSB, MDF, spånskivor och ce-mentbundna spånskivor)\n• Gipsskivor och gips\n• Bituminösa material, såsom taktäckningsmembran och asfalt\n• Andra mineralbaserade material, inklusive fibercement och kalciumsilikat\n• Produkter med återvunnet material\n\n2. För varje relevant material bedöms den certifieringsnivå och -omfattning som materialleverantör el-ler tillverkare har uppnått, se Ytterligare information; Tabell 21 Ansvarsfull inköp, nivåer och kriterier och Tabell 22 EMS-kriterier.\n3. Verktyget för ansvarsfulla inköp används, och den beräkningsmetoden följs som redovisas i Ytterli-gare information för bestämning av antalet erhållna poäng.\n4. Eventuellt icke-certifierat trävirke som används och som kommer från godkänd producent, ingår inte i CITES-listan (se definition för trävirke som är avverkat på lagligt sätt).\n\n\nKriterier för exemplarisk nivå \nNedan beskrivs exemplariska nivåerna för en innovationspoäng i denna BREEAM-indikator:\n1. Om, förutom ovan nämnda kriterier, 95 % av de material som ingår i relevanta byggnadselement, har köpts in på ett ansvarsfullt sätt.","Bedömning av nybyggnad och större ombyggnad\n1. Upp till tre poäng kan erhållas om det finns bevis för att 80 % av relevanta material (se listan nedan) i vart och ett av följande byggnadselement, är anskaffade på ett ansvarsfullt sätt:\na. Byggnadsstomme \nb. Grund\nc. Mellanbjälklag\nd. Yttertak\ne. Ytterväggar\nf. Innerväggar\ng. Fundament/grundkonstruktion\nh. Trapphus\n\nRelevanta material\n• Mursten (inklusive tegel, klinker och andra keramiska)\n• Hartsbaserade material och metallkeramiska kompositer, inklusive glasfiberförstärkt plast och po-lymerputs\n• Betong (inklusive platsgjuten och prefabricerad, betongblock, keramik, murbruk, cementbaserad puts osv)\n• Glas\n• Plast och gummi (inklusive takmembran av EPDM, TPO, PVC och VET inklusive polymerputs)\n• Metaller (stål, aluminium etc)\n• Natursten, byggnadssten och skiffer\n• Trävirke, träkomposit och träpaneler (inklusive limträ, plywood, OSB, MDF, spånskivor och ce-mentbundna spånskivor)\n• Gipsskivor och gips\n• Bituminösa material, såsom taktäckningsmembran och asfalt\n• Andra mineralbaserade material, inklusive fibercement och kalciumsilikat\n• Produkter med återvunnet material\n\nObservera att isoleringsmaterial, infästningar, lim och tillsatser undantas från bedömning. Vad gäller alla andra material som utgör en del av ett relevant byggnadselement och som saknas i listan, kontak-tas SGBC för identifiering av relevanta nyckel- och leveransprocesser.\n\n2. Varje relevant material bedöms utifrån den certifieringsnivå och omfattning som materialleverantör eller tillverkare har uppnått, se Ytterligare information; Tabell 21 Ansvarsfull inköp, nivåer och krite-rier och Tabell 22 EMS-kriterier.\n3. Använd verktyget för ansvarsfulla inköp och följ beräkningsmetoden som redovisas i Ytterligare in-formation för bestämning av antalet erhållna poäng.\n4. Eventuellt icke-certifierat trävirke som används och som kommer från godkänd producent, ingår inte i CITES-listan (se definition för trävirke avverkat på lagligt sätt).\n\nBedömning av endast inredning\n1. Upp till två poäng kan erhållas om bevis presenteras på att 80 % av relevanta material (se listan nedan), i följande inredningselement, är inköpta på ett ansvarsfullt sätt:\na. Trappor\nb. Fönster\nc. Utvändiga och invändiga dörrar\nd. Golvlister\ne. Panel\nf. Inventarier\ng. Lister\nh. All annan betydande användning\n\nRelevanta material\n• Mursten (inklusive tegel, klinker och annan keramik)\n• Hartsbaserade material och metallkeramiska kompositer, inklusive glasfiberförstärkt plast och po-lymerputs \n• Betong (inklusive platsgjuten och prefabricerad, betongblock, keramik, murbruk, cementbaserad puts osv)\n• Glas\n• Plast och gummi (inklusive takmembran av EPDM, TPO, PVC och VET inklusive polymerputs)\n• Metaller (stål, aluminium etc)\n• Natursten, byggnadssten och skiffer\n• Trävirke, träkomposit och träpaneler (inklusive limträ, plywood, OSB, MDF, spånskivor och ce-mentbundna spånskivor)\n• Gipsskivor och gips\n• Bituminösa material, såsom taktäckningsmembran och asfalt\n• Andra mineralbaserade material, inklusive fibercement och kalciumsilikat\n• Produkter med återvunnet material\n\n2. För varje relevant material bedöms den certifieringsnivå och -omfattning som materialleverantör el-ler tillverkare har uppnått, se Ytterligare information; Tabell 21 Ansvarsfull inköp, nivåer och kriterier och Tabell 22 EMS-kriterier.\n3. Verktyget för ansvarsfulla inköp används, och den beräkningsmetoden följs som redovisas i Ytterli-gare information för bestämning av antalet erhållna poäng.\n4. Eventuellt icke-certifierat trävirke som används och som kommer från godkänd producent, ingår inte i CITES-listan (se definition för trävirke som är avverkat på lagligt sätt).\n\nKriterier för exemplarisk nivå \nNedan beskrivs exemplariska nivåerna för en innovationspoäng i denna BREEAM-indikator:\n1. Om, förutom ovan nämnda kriterier, 95 % av de material som ingår i relevanta byggnadselement, har köpts in på ett ansvarsfullt sätt.",{"$f":"$D101","v":"Up to 3 credits are available where evidence provided demonstrates that 80% of\nthe assessed materials in the following building elements are responsibly\nsourced:\na. Structural Frame\nb. Ground floor\nc. Upper floors (including separating floors)\nd. Roof\ne. External walls\nf. Internal walls\ng. Foundation/substructure\nh. Staircase\n\nAdditionally 100% of any timber must be legally sourced."},null,null,null,"Bedömning av nybyggnad och större ombyggnad\n1. Upp till tre poäng kan erhållas om det finns bevis för att 80 % av relevanta material (se listan nedan) i vart och ett av följande byggnadselement, är anskaffade på ett ansvarsfullt sätt:\na. Byggnadsstomme \nb. Grund\nc. Mellanbjälklag\nd. Yttertak\ne. Ytterväggar\nf. Innerväggar\ng. Fundament/grundkonstruktion\nh. Trapphus\n\nRelevanta material\n• Mursten (inklusive tegel, klinker och andra keramiska)\n• Hartsbaserade material och metallkeramiska kompositer, inklusive glasfiberförstärkt plast och po-lymerputs\n• Betong (inklusive platsgjuten och prefabricerad, betongblock, keramik, murbruk, cementbaserad puts osv)\n• Glas\n• Plast och gummi (inklusive takmembran av EPDM, TPO, PVC och VET inklusive polymerputs)\n• Metaller (stål, aluminium etc)\n• Natursten, byggnadssten och skiffer\n• Trävirke, träkomposit och träpaneler (inklusive limträ, plywood, OSB, MDF, spånskivor och ce-mentbundna spånskivor)\n• Gipsskivor och gips\n• Bituminösa material, såsom taktäckningsmembran och asfalt\n• Andra mineralbaserade material, inklusive fibercement och kalciumsilikat\n• Produkter med återvunnet material\n\nObservera att isoleringsmaterial, infästningar, lim och tillsatser undantas från bedömning. Vad gäller alla andra material som utgör en del av ett relevant byggnadselement och som saknas i listan, kontak-tas SGBC för identifiering av relevanta nyckel- och leveransprocesser.\n\n2. Varje relevant material bedöms utifrån den certifieringsnivå och omfattning som materialleverantör eller tillverkare har uppnått, se Ytterligare information; Tabell 21 Ansvarsfull inköp, nivåer och krite-rier och Tabell 22 EMS-kriterier.\n3. Använd verktyget för ansvarsfulla inköp och följ beräkningsmetoden som redovisas i Ytterligare in-formation för bestämning av antalet erhållna poäng.\n4. Eventuellt icke-certifierat trävirke som används och som kommer från godkänd producent, ingår inte i CITES-listan (se definition för trävirke avverkat på lagligt sätt).\n\nBedömning av endast inredning\n1. Upp till två poäng kan erhållas om bevis presenteras på att 80 % av relevanta material (se listan nedan), i följande inredningselement, är inköpta på ett ansvarsfullt sätt:\na. Trappor\nb. Fönster\nc. Utvändiga och invändiga dörrar\nd. Golvlister\ne. Panel\nf. Inventarier\ng. Lister\nh. All annan betydande användning\n\nRelevanta material\n• Mursten (inklusive tegel, klinker och annan keramik)\n• Hartsbaserade material och metallkeramiska kompositer, inklusive glasfiberförstärkt plast och po-lymerputs \n• Betong (inklusive platsgjuten och prefabricerad, betongblock, keramik, murbruk, cementbaserad puts osv)\n• Glas\n• Plast och gummi (inklusive takmembran av EPDM, TPO, PVC och VET inklusive polymerputs)\n• Metaller (stål, aluminium etc)\n• Natursten, byggnadssten och skiffer\n• Trävirke, träkomposit och träpaneler (inklusive limträ, plywood, OSB, MDF, spånskivor och ce-mentbundna spånskivor)\n• Gipsskivor och gips\n• Bituminösa material, såsom taktäckningsmembran och asfalt\n• Andra mineralbaserade material, inklusive fibercement och kalciumsilikat\n• Produkter med återvunnet material\n\n2. För varje relevant material bedöms den certifieringsnivå och -omfattning som materialleverantör el-ler tillverkare har uppnått, se Ytterligare information; Tabell 21 Ansvarsfull inköp, nivåer och kriterier och Tabell 22 EMS-kriterier.\n3. Verktyget för ansvarsfulla inköp används, och den beräkningsmetoden följs som redovisas i Ytterli-gare information för bestämning av antalet erhållna poäng.\n4. Eventuellt icke-certifierat trävirke som används och som kommer från godkänd producent, ingår inte i CITES-listan (se definition för trävirke som är avverkat på lagligt sätt).\n\nKriterier för exemplarisk nivå \nNedan beskrivs exemplariska nivåerna för en innovationspoäng i denna BREEAM-indikator:\n1. Om, förutom ovan nämnda kriterier, 95 % av de material som ingår i relevanta byggnadselement, har köpts in på ett ansvarsfullt sätt.",{"$f":"$D101","v":"Up to 3 credits are available where evidence provided demonstrates that 80% of\nthe assessed materials in the following building elements are responsibly\nsourced:\na. Structural Frame\nb. Ground floor\nc. Upper floors (including separating floors)\nd. Roof\ne. External walls\nf. Internal walls\ng. Foundation/substructure\nh. Staircase\n\nAdditionally 100% of any timber must be legally sourced."},null,0,null,null,null,null,0,null,null,null,{"$error":"#NAME?"},{"$error":"#NAME?"},{"$error":"#NAME?"},{"$error":"#NAME?"},{"$error":"#NAME?"},null,null,null,null,0,3,0,3,null,null,null,null,null,null,null,null,0,3,0,3,null,null,null,null,1,null,null,null,null,null,null,null,null,null,null,null,null,null,1,"Y",null,null,{"$f":"IF(Offnewrefurb=\"y\",1,0)","v":0},null,null,null,null,null,null,null,0,"N",null,1,null,null,1,"Y",null,1,null,null,null,null,null,null,null,1,"Y",null,null,{"$f":"IF(RETnewrefurb=\"y\",1,0)","v":0},null,null,null,null,null,null,null,null,null,null,null,null,null,null,null,null,null,null,0,"N",null,1,null,null,null,null,null,null,null,null,null,null,1,"Y",null,null,{"$f":"IF(INDnewrefurb=\"y\",1,0)","v":0},null,null,null,null,null,null,null,null,null,null,null,null,null,0,"N",null,null,0,0,0,0,0]
[null,"Mat 5","Materialval utifrån ansvarsfull tillverkning och utvinning - endast inredning","Up to 3 credits are available where evidence provided demonstrates that 80% of\nthe assessed materials in the following building elements are responsibly\nsourced:\na. Structural Frame\nb. Ground floor\nc. Upper floors (including separating floors)\nd. Roof\ne. External walls\nf. Internal walls\ng. Foundation/substructure\nh. Staircase\n\nAdditionally 100% of any timber must be legally sourced.",null,"Bedömning av nybyggnad och större ombyggnad\n1. Upp till tre poäng kan erhållas om det finns bevis för att 80 % av relevanta material (se listan nedan) i vart och ett av följande byggnadselement, är anskaffade på ett ansvarsfullt sätt:\na. Byggnadsstomme \nb. Grund\nc. Mellanbjälklag\nd. Yttertak\ne. Ytterväggar\nf. Innerväggar\ng. Fundament/grundkonstruktion\nh. Trapphus\n\nRelevanta material\n• Mursten (inklusive tegel, klinker och andra keramiska)\n• Hartsbaserade material och metallkeramiska kompositer, inklusive glasfiberförstärkt plast och polymerputs\n• Betong (inklusive platsgjuten och prefabricerad, betongblock, keramik, murbruk, cementbaserad puts osv)\n• Glas\n• Plast och gummi (inklusive takmembran av EPDM, TPO, PVC och VET inklusive polymerputs)\n• Metaller (stål, aluminium etc)\n• Natursten, byggnadssten och skiffer\n• Trävirke, träkomposit och träpaneler (inklusive limträ, plywood, OSB, MDF, spånskivor och ce-mentbundna spånskivor)\n• Gipsskivor och gips\n• Bituminösa material, såsom taktäckningsmembran och asfalt\n• Andra mineralbaserade material, inklusive fibercement och kalciumsilikat\n• Produkter med återvunnet material\n\nObservera att isoleringsmaterial, infästningar, lim och tillsatser undantas från bedömning. Vad gäller alla andra material som utgör en del av ett relevant byggnadselement och som saknas i listan, kontak-tas SGBC för identifiering av relevanta nyckel- och leveransprocesser.\n\n2. Varje relevant material bedöms utifrån den certifieringsnivå och omfattning som materialleverantör eller tillverkare har uppnått, se Ytterligare information; Tabell 21 Ansvarsfull inköp, nivåer och krite-rier och Tabell 22 EMS-kriterier.\n3. Använd verktyget för ansvarsfulla inköp och följ beräkningsmetoden som redovisas i Ytterligare in-formation för bestämning av antalet erhållna poäng.\n4. Eventuellt icke-certifierat trävirke som används och som kommer från godkänd producent, ingår inte i CITES-listan (se definition för trävirke avverkat på lagligt sätt).\n\nBedömning av endast inredning\n1. Upp till två poäng kan erhållas om bevis presenteras på att 80 % av relevanta material (se listan nedan), i följande inredningselement, är inköpta på ett ansvarsfullt sätt:\na. Trappor\nb. Fönster\nc. Utvändiga och invändiga dörrar\nd. Golvlister\ne. Panel\nf. Inventarier\ng. Lister\nh. All annan betydande användning\n\nRelevanta material\n• Mursten (inklusive tegel, klinker och annan keramik)\n• Hartsbaserade material och metallkeramiska kompositer, inklusive glasfiberförstärkt plast och po-lymerputs \n• Betong (inklusive platsgjuten och prefabricerad, betongblock, keramik, murbruk, cementbaserad puts osv)\n• Glas\n• Plast och gummi (inklusive takmembran av EPDM, TPO, PVC och VET inklusive polymerputs)\n• Metaller (stål, aluminium etc)\n• Natursten, byggnadssten och skiffer\n• Trävirke, träkomposit och träpaneler (inklusive limträ, plywood, OSB, MDF, spånskivor och ce-mentbundna spånskivor)\n• Gipsskivor och gips\n• Bituminösa material, såsom taktäckningsmembran och asfalt\n• Andra mineralbaserade material, inklusive fibercement och kalciumsilikat\n• Produkter med återvunnet material\n\n2. För varje relevant material bedöms den certifieringsnivå och -omfattning som materialleverantör el-ler tillverkare har uppnått, se Ytterligare information; Tabell 21 Ansvarsfull inköp, nivåer och kriterier och Tabell 22 EMS-kriterier.\n3. Verktyget för ansvarsfulla inköp används, och den beräkningsmetoden följs som redovisas i Ytterli-gare information för bestämning av antalet erhållna poäng.\n4. Eventuellt icke-certifierat trävirke som används och som kommer från godkänd producent, ingår inte i CITES-listan (se definition för trävirke som är avverkat på lagligt sätt).\n\n\nKriterier för exemplarisk nivå \nNedan beskrivs exemplariska nivåerna för en innovationspoäng i denna BREEAM-indikator:\n1. Om, förutom ovan nämnda kriterier, 95 % av de material som ingår i relevanta byggnadselement, har köpts in på ett ansvarsfullt sätt.","Bedömning av endast inredning \n1. Upp till två poäng kan erhållas om bevis presenteras på att 80 % av relevanta material (se listan \nnedan), i följande inredningselement, är inköpta på ett ansvarsfullt sätt: \na. Trappor \nb. Fönster \nc. Utvändiga och invändiga dörrar \nd. Golvlister \ne. Panel \nf. Inventarier \ng. Lister \nh. All annan betydande användning ","N/A",null,null,null,"Up to 2 credits are available where evidence provided demonstrates 80% of the assessed materials in the following finishing elements are responsibly sourced: \na. Stairs\nb. Windows\nc. External and internal doors\nd. Skirting\ne. Panelling\nf. Furniture\ng. Fascias\nh. Any other significant use\n\nAdditionally 100% of any timber must be legally sourced.","Up to 2 credits are available where evidence provided demonstrates 80% of the assessed materials in the following finishing elements are responsibly sourced: \na. Stairs\nb. Windows\nc. External and internal doors\nd. Skirting\ne. Panelling\nf. Furniture\ng. Fascias\nh. Any other significant use\n\nAdditionally 100% of any timber must be legally sourced.",null,2,null,null,null,null,0,null,null,null,{"$error":"#NAME?"},{"$error":"#NAME?"},{"$error":"#NAME?"},{"$error":"#NAME?"},{"$error":"#NAME?"},null,null,null,null,0,2,2,2,null,null,null,null,null,null,null,null,0,2,0,2,null,null,null,null,null,null,null,null,null,null,null,null,null,null,null,null,null,null,0,"N",null,null,null,{"$f":"IF(OFFfitout=\"y\",1,0)","v":1},null,null,null,null,null,null,1,"Y",null,0,null,null,0,"N",null,0,null,null,null,null,null,null,null,0,"N",null,null,null,{"$f":"IF(RETfitout=\"y\",1,0)","v":0},null,null,null,null,null,null,null,null,null,null,null,null,null,null,null,null,null,0,"N",null,0,null,null,null,null,null,null,null,null,null,null,0,"N",null,null,null,{"$f":"IF(INDfitout=\"y\",1,0)","v":0},null,null,null,null,null,null,null,null,null,null,null,null,0,"N",null,null,0,0,0,0,0]
[null,"Mat 6","Isolering","One credit where evidence provided demonstrates that thermal insulation products used in the building have a low embodied impact relative to their thermal properties, determined by the Green Guide to Specification ratings.\n\nOne credit where evidence provided demonstrates that thermal insulation products used in the building have been responsibly sourced.",null,"1. All ny isolering i följande byggnadselement ska bedömas:\n• Ytterväggar\n• Grundkonstruktion\n• Yttertak\n• Installationssystem \n\nFörsta poängen\n2. Betyg i Green Guide för termiska isoleringsmaterial ska bestämmas. Betyg för termisk isolering finns på: www.thegreenguide.org.uk (se Tolkning av bedömningskriterier, när specificerad isolering bedöms för byggnadselement i Mat 1).\n3. Isoleringsindex för byggnadens isolering är 2 eller högre. \n4. Isoleringsindex beräknas med Mat 6 Insulation Index Calculator Tool i BREEAM-assessorns be-räkningsverktyg. För varje typ av termisk isolering i relevanta byggnadselement beräknas det vo-lymviktade termiska motståndet på följande sätt:\na. Isoleringsarea (m2) * tjocklek (m)/värmeledningsförmåga (W/m,K) \nELLER\nb. Total isoleringsvolym (m3)/värmeledningsförmåga (W/m,K)\n\nVolymviktad termisk isolering för varje isoleringsmaterial multipliceras därefter med relevant betyg i Green Guide enligt Tabell 23.\n\nAndra poängen\n5. Minst 80 % av den termiska isoleringen i byggnadselementen i punkt 1, ska vara ansvarsfullt an-skaffat. Det vill säga varje isoleringsprodukt ska vara certifierad enligt nivå 1, 2 eller 3 i Tabell 21 Nivåer och kriterier, i Mat 5. Tabell 24 nedan visar nyckelprocesser och rutiner hos för leverantörs-kedjor som krävs för vanliga isoleringsprodukter.","1. All ny isolering i följande byggnadselement ska bedömas:\n• Ytterväggar\n• Grundkonstruktion\n• Yttertak\n• Installationssystem \n\nFörsta poängen\n2. Betyg i Green Guide för termiska isoleringsmaterial ska bestämmas. Betyg för termisk isolering finns på: www.thegreenguide.org.uk (se Tolkning av bedömningskriterier, när specificerad isolering bedöms för byggnadselement i Mat 1).\n3. Isoleringsindex för byggnadens isolering är 2 eller högre. \n4. Isoleringsindex beräknas med Mat 6 Insulation Index Calculator Tool i BREEAM-assessorns be-räkningsverktyg. För varje typ av termisk isolering i relevanta byggnadselement beräknas det vo-lymviktade termiska motståndet på följande sätt:\na. Isoleringsarea (m2) * tjocklek (m)/värmeledningsförmåga (W/m,K) \nELLER\nb. Total isoleringsvolym (m3)/värmeledningsförmåga (W/m,K)\n\nVolymviktad termisk isolering för varje isoleringsmaterial multipliceras därefter med relevant betyg i Green Guide enligt Tabell 23.\n\nAndra poängen\n5. Minst 80 % av den termiska isoleringen i byggnadselementen i punkt 1, ska vara ansvarsfullt an-skaffat. Det vill säga varje isoleringsprodukt ska vara certifierad enligt nivå 1, 2 eller 3 i Tabell 21 Nivåer och kriterier, i Mat 5. Tabell 24 nedan visar nyckelprocesser och rutiner hos för leverantörs-kedjor som krävs för vanliga isoleringsprodukter.",{"$f":"$D103","v":"One credit where evidence provided demonstrates that thermal insulation products used in the building have a low embodied impact relative to their thermal properties, determined by the Green Guide to Specification ratings.\n\nOne credit where evidence provided demonstrates that thermal insulation products used in the building have been responsibly sourced."},null,null,null,"1. All ny isolering i följande byggnadselement ska bedömas:\n• Ytterväggar\n• Grundkonstruktion\n• Yttertak\n• Installationssystem \n\nFörsta poängen\n2. Betyg i Green Guide för termiska isoleringsmaterial ska bestämmas. Betyg för termisk isolering finns på: www.thegreenguide.org.uk (se Tolkning av bedömningskriterier, när specificerad isolering bedöms för byggnadselement i Mat 1).\n3. Isoleringsindex för byggnadens isolering är 2 eller högre. \n4. Isoleringsindex beräknas med Mat 6 Insulation Index Calculator Tool i BREEAM-assessorns be-räkningsverktyg. För varje typ av termisk isolering i relevanta byggnadselement beräknas det volymviktade termiska motståndet på följande sätt:\na. Isoleringsarea (m2) * tjocklek (m)/värmeledningsförmåga (W/m,K) \nELLER\nb. Total isoleringsvolym (m3)/värmeledningsförmåga (W/m,K)\n\nVolymviktad termisk isolering för varje isoleringsmaterial multipliceras därefter med relevant betyg i Green Guide enligt Tabell 23.\n\nAndra poängen\n5. Minst 80 % av den termiska isoleringen i byggnadselementen i punkt 1, ska vara ansvarsfullt an-skaffat. Det vill säga varje isoleringsprodukt ska vara certifierad enligt nivå 1, 2 eller 3 i Tabell 21 Nivåer och kriterier, i Mat 5. Tabell 24 nedan visar nyckelprocesser och rutiner hos för leverantörs-kedjor som krävs för vanliga isoleringsprodukter.",{"$f":"$D103","v":"One credit where evidence provided demonstrates that thermal insulation products used in the building have a low embodied impact relative to their thermal properties, determined by the Green Guide to Specification ratings.\n\nOne credit where evidence provided demonstrates that thermal insulation products used in the building have been responsibly sourced."},null,2,null,null,null,null,{"$f":"IF(partnewpartrefurb=\"y\",(Q103*$Q$16)+(R103*$R$16),0)","v":0},null,null,null,{"$error":"#NAME?"},{"$error":"#NAME?"},{"$error":"#NAME?"},{"$error":"#NAME?"},{"$error":"#NAME?"},null,null,null,null,2,2,2,2,null,null,null,null,null,null,null,null,2,2,2,2,null,null,null,null,1,null,null,null,null,null,null,null,null,null,null,null,null,null,1,"Y",null,1,null,null,null,null,null,null,null,null,1,"Y",null,1,null,null,1,"Y",null,1,null,null,null,null,null,null,null,1,"Y",null,1,null,null,null,null,null,null,null,null,null,null,null,null,null,null,null,null,null,null,null,1,"Y",null,1,null,null,null,null,null,null,null,null,null,null,1,"Y",null,1,null,null,null,null,null,null,null,null,null,null,null,null,null,null,1,"Y",null,null,0,0,0,0,0]
[null,"Mat 7","Robust konstruktion","One credit where protection is given to vulnerable parts of the building such as areas exposed to high pedestrian traffic, vehicular and trolley movements.",null,"1. Områden i och runt byggnaden som trafikeras av fordon, vagnar och gående identifieras.\n2. Lämpliga skyddsåtgärder specificerats som förhindrar skador på grund av trafik på sårbara delar av byggnaden. Åtgärderna ska omfatta, men inte nödvändigtvis begränsas till:\na. Skydd mot konsekvenser av mycket gångtrafik i huvudentréer, allmänna utrymmen och i passager (korridorer, hissar, trappor, dörrar etc.).\nb. Skydd mot fordonstrafik/vagnar som rör sig inomhus inom 1 m från invändiga byggnadsdelar i lager, leveransutrymmen, korridorer och kök.\nc. Skydda mot, eller förhindra påkörning med fordon som parkeras och manövreras inom 1 m från utvändig byggnadsfasad på parkeringsplatser, och inom 2 m på alla leveransplatser.","1. Områden i och runt byggnaden som trafikeras av fordon, vagnar och gående identifieras.\n2. Lämpliga skyddsåtgärder specificerats som förhindrar skador på grund av trafik på sårbara delar av byggnaden. Åtgärderna ska omfatta, men inte nödvändigtvis begränsas till:\na. Skydd mot konsekvenser av mycket gångtrafik i huvudentréer, allmänna utrymmen och i passager (korridorer, hissar, trappor, dörrar etc.).\nb. Skydd mot fordonstrafik/vagnar som rör sig inomhus inom 1 m från invändiga byggnadsdelar i lager, leveransutrymmen, korridorer och kök.\nc. Skydda mot, eller förhindra påkörning med fordon som parkeras och manövreras inom 1 m från utvändig byggnadsfasad på parkeringsplatser, och inom 2 m på alla leveransplatser.",{"$f":"$D104","v":"One credit where protection is given to vulnerable parts of the building such as areas exposed to high pedestrian traffic, vehicular and trolley movements."},null,null,null,"1. Områden i och runt byggnaden som trafikeras av fordon, vagnar och gående identifieras.\n2. Lämpliga skyddsåtgärder specificerats som förhindrar skador på grund av trafik på sårbara delar av byggnaden. Åtgärderna ska omfatta, men inte nödvändigtvis begränsas till:\na. Skydd mot konsekvenser av mycket gångtrafik i huvudentréer, allmänna utrymmen och i passager (korridorer, hissar, trappor, dörrar etc.).\nb. Skydd mot fordonstrafik/vagnar som rör sig inomhus inom 1 m från invändiga byggnadsdelar i lager, leveransutrymmen, korridorer och kök.\nc. Skydda mot, eller förhindra påkörning med fordon som parkeras och manövreras inom 1 m från utvändig byggnadsfasad på parkeringsplatser, och inom 2 m på alla leveransplatser.",{"$f":"$D104","v":"One credit where protection is given to vulnerable parts of the building such as areas exposed to high pedestrian traffic, vehicular and trolley movements."},null,1,null,null,null,null,{"$f":"IF(partnewpartrefurb=\"y\",(Q104*$Q$16)+(R104*$R$16),0)","v":0},null,null,null,{"$error":"#NAME?"},{"$error":"#NAME?"},{"$error":"#NAME?"},{"$error":"#NAME?"},{"$error":"#NAME?"},null,null,null,null,1,1,1,1,null,null,null,null,null,null,null,null,1,1,1,1,null,null,null,null,1,null,null,null,null,null,null,null,null,null,null,null,null,null,{"$f":"SUM(BA104:BN104)","v":1},"Y",null,1,null,null,null,null,null,null,null,null,1,"Y",null,1,null,null,1,"Y",null,1,null,null,null,null,null,null,null,1,"Y",null,1,null,null,null,null,null,null,null,null,null,null,null,null,null,null,null,null,null,null,null,1,"Y",null,1,null,null,null,null,null,null,null,null,null,null,1,"Y",null,1,null,null,null,null,null,null,null,null,null,null,null,null,null,null,1,"Y",null,null,0,0,0,0,0]
[null,"Mat 8","Utfasning av farliga ämnen",null,null,"En poäng\n1. Ett accepterat system för bedömning av byggvaror har använts för att fastställa att ämnen med ut-fasningsegenskaper enligt KEMI endast förekommer i mindre utsträckning i byggnadsdelarna i Tabell A, Eventuella byggvaror som används och som innehåller ämnen med utfasningsegenskaper, ska dokumenteras i en avvikelserapport.","En poäng\n1. Ett accepterat system för bedömning av byggvaror har använts för att fastställa att ämnen med utfasningsegenskaper enligt KEMI endast förekommer i mindre utsträckning i byggnadsdelarna i Tabell A, Eventuella byggvaror som används och som innehåller ämnen med utfasningsegenskaper, ska dokumenteras i en avvikelserapport.",null,null,null,null,"En poäng\n1. Ett accepterat system för bedömning av byggvaror har använts för att fastställa att ämnen med ut-fasningsegenskaper enligt KEMI endast förekommer i mindre utsträckning i byggnadsdelarna i Tabell A, Eventuella byggvaror som används och som innehåller ämnen med utfasningsegenskaper, ska dokumenteras i en avvikelserapport.",{"$f":"$D105","v":0},null,1,null,null,null,null,null,null,null,null,{"$error":"#NAME?"},{"$error":"#NAME?"},{"$error":"#NAME?"},{"$error":"#NAME?"},{"$error":"#NAME?"},null,null,null,null,1,1,1,1,null,null,null,null,null,null,null,null,1,1,0,null,null,null,null,null,null,null,null,null,null,null,null,null,null,null,null,null,null,null,0,"N",null,1,null,null,null,null,null,null,null,null,{"$f":"SUM(BR105:BZ105)","v":1},{"$f":"IF(CA105>=0.1,\"Y\",\"N\")","v":"Y"},null,null,null,null,null,null,null,null,null,null,null,null,null,null,null,null,null,null,1,null,null,null,null,null,null,null,null,null,null,null,null,null,null,null,null,null,null,null,{"$f":"SUM(CU105:DN105)","v":1},{"$f":"IF(DO105>=0.1,\"Y\",\"N\")","v":"Y"},null,null,null,null,null,null,null,null,null,null,null,null,null,null,null,1,null,null,null,null,null,null,null,null,null,null,null,null,null,null,{"$f":"SUM(EF105:ET105)","v":1},{"$f":"IF(EU105>=0.1,\"Y\",\"N\")","v":"Y"},null,null,0,0,0,0,0]
[null,"Waste"]
[null,"Wst 1","Avfallshantering på byggarbetsplatsen","One credit where evidence provided demonstrates that a site waste management plan has been developed and implemented. Two credits where evidence provided demonstrates that the first credit has been achieved and waste reduction is a key priority of the site waste management plan. Three credits where evidence provided demonstrates that a significant majority of non-hazardous construction waste generated by the development will be diverted from landfill and reused or recycled.",null," Första poängen\n1. En plan för avfallshantering, se definition i Ytterligare information, utarbetas och genomförs enligt checklista A15a.\n2. Dessutom, om det på tomten finns byggnader som ska byggas om eller rivas, och där rivningen ingår i huvudentreprenörens kontrakt, ska följande krav uppfyllas:\na. En förstudie före rivning/ombyggnad ska genomföras av de befintliga byggnader som ska rivas eller renoveras. Detta för att avgöra om renovering är genomförbart om det rör sig om rivning, om inte så för att maximera återvinning av material från rivning eller renovering. I planen för avfallshantering ska det hänvisas till denna förstudie som ska omfatta \ni. Identifiering av de viktigaste ombyggnads- och rivningsmaterialen\nii. Beskrivning av möjlig användning och eventuella användningsområden för återan-vändning och återvinning av de viktigaste ombyggnads- och rivningsmaterialen\n\nAndra poängen\n1. Första poängen är uppnådd.\n2. Mål är formulerade för att minska mängden avfall som genereras på byggarbetsplatsen. Målen ska redovisas och motiveras i planen för avfallshantering och vid färdigställande.\n3. Minst tre viktiga avfallskategorier har reduceringspotential vid projekteringsskedet (checklista A15b). Dessa kategorier ska följas upp under hela byggskedet som en del av implementeringen av planen för avfallshantering. Uppnådda resultat ska redovisas i planen för avfallshantering vid fär-digställande.\n\nTredje poängen\n1. Minst fyra viktiga avfallskategorier eller lägsta antal enligt lokala regler plus en (högsta alternativet väljs), är identifierade i planeringsskedet att styras bort från deponi. Planen för avfallshantering och checklista A15b har uppdaterats enligt detta. \n2. Avfall sorteras enligt ovan, om möjligt på byggarbetsplatsen. Sortering på annat ställe är endast ett alternativ om det inte är möjligt att göra på byggarbetsplatsen, vilket i så fall ska motiveras.  \n3. Detta ska kvantifieras och följas upp under byggskedet och redovisas i planen för avfallshantering vid färdigställandet. \n\nKriterier för exemplarisk nivå se manualen.\n"," Första poängen\n1. En plan för avfallshantering, se definition i Ytterligare information, utarbetas och genomförs enligt checklista A15a.\n2. Dessutom, om det på tomten finns byggnader som ska byggas om eller rivas, och där rivningen ingår i huvudentreprenörens kontrakt, ska följande krav uppfyllas:\na. En förstudie före rivning/ombyggnad ska genomföras av de befintliga byggnader som ska rivas eller renoveras. Detta för att avgöra om renovering är genomförbart om det rör sig om rivning, om inte så för att maximera återvinning av material från rivning eller renovering. I planen för avfallshantering ska det hänvisas till denna förstudie som ska omfatta \ni. Identifiering av de viktigaste ombyggnads- och rivningsmaterialen\nii. Beskrivning av möjlig användning och eventuella användningsområden för återan-vändning och återvinning av de viktigaste ombyggnads- och rivningsmaterialen\n\nAndra poängen\n1. Första poängen är uppnådd.\n2. Mål är formulerade för att minska mängden avfall som genereras på byggarbetsplatsen. Målen ska redovisas och motiveras i planen för avfallshantering och vid färdigställande.\n3. Minst tre viktiga avfallskategorier har reduceringspotential vid projekteringsskedet (checklista A15b). Dessa kategorier ska följas upp under hela byggskedet som en del av implementeringen av planen för avfallshantering. Uppnådda resultat ska redovisas i planen för avfallshantering vid fär-digställande.\n\nTredje poängen\n1. Minst fyra viktiga avfallskategorier eller lägsta antal enligt lokala regler plus en (högsta alternativet väljs), är identifierade i planeringsskedet att styras bort från deponi. Planen för avfallshantering och checklista A15b har uppdaterats enligt detta. \n2. Avfall sorteras enligt ovan, om möjligt på byggarbetsplatsen. Sortering på annat ställe är endast ett alternativ om det inte är möjligt att göra på byggarbetsplatsen, vilket i så fall ska motiveras.  \n3. Detta ska kvantifieras och följas upp under byggskedet och redovisas i planen för avfallshantering vid färdigställandet. \n\nKriterier för exemplarisk nivå\nNedan beskrivs kriterier för en innovationspoäng för denna BREEAM-indikator. \n1. Alla tre poängen har uppnåtts. \n2. Alla viktiga avfallskategorier som styrs bort från deponi är identifierade i planen för avfallshantering. \n3. Minst fem av de viktiga avfallskategorierna har reduceringspotential vid projekteringsskedet (check-lista A15b). Dessa ska följas upp under hela byggskedet som en del av implementeringen av pla-nen för avfallshantering. Uppnådda resultat ska redovisas i planen för avfallshantering vid färdigställande.\n4. Minst basnivåerna för avfallsfraktioner har identifierade att styras bort från deponi: (Avfallsfraktioner vid rivning - basnivå) enligt Kretsloppsrådets riktlinjer för avfallshantering vid byggande och rivning, \n\nByggnader som uppfyller kriterierna för exemplarisk nivå erhåller fyra poäng i denna indikator.",{"$f":"$D107","v":"One credit where evidence provided demonstrates that a site waste management plan has been developed and implemented. Two credits where evidence provided demonstrates that the first credit has been achieved and waste reduction is a key priority of the site waste management plan. Three credits where evidence provided demonstrates that a significant majority of non-hazardous construction waste generated by the development will be diverted from landfill and reused or recycled."},null,null,null,"Första poängen\n1. En plan för avfallshantering, se definition i Ytterligare information, utarbetas och genomförs enligt checklista A15a.\n2. Dessutom, om det på tomten finns byggnader som ska byggas om eller rivas, och där rivningen ingår i huvudentreprenörens kontrakt, ska följande krav uppfyllas:\na. En förstudie före rivning/ombyggnad ska genomföras av de befintliga byggnader som ska rivas eller renoveras. Detta för att avgöra om renovering är genomförbart om det rör sig om rivning, om inte så för att maximera återvinning av material från rivning eller renovering. I planen för avfallshantering ska det hänvisas till denna förstudie som ska omfatta \ni. Identifiering av de viktigaste ombyggnads- och rivningsmaterialen\nii. Beskrivning av möjlig användning och eventuella användningsområden för återan-vändning och återvinning av de viktigaste ombyggnads- och rivningsmaterialen\n\nAndra poängen\n1. Första poängen är uppnådd.\n2. Mål är formulerade för att minska mängden avfall som genereras på byggarbetsplatsen. Målen ska redovisas och motiveras i planen för avfallshantering och vid färdigställande.\n3. Minst tre viktiga avfallskategorier har reduceringspotential vid projekteringsskedet (checklista A15b). Dessa kategorier ska följas upp under hela byggskedet som en del av implementeringen av planen för avfallshantering. Uppnådda resultat ska redovisas i planen för avfallshantering vid fär-digställande.\n\nTredje poängen\n1. Minst fyra viktiga avfallskategorier eller lägsta antal enligt lokala regler plus en (högsta alternativet väljs), är identifierade i planeringsskedet att styras bort från deponi. Planen för avfallshantering och checklista A15b har uppdaterats enligt detta. \n2. Avfall sorteras enligt ovan, om möjligt på byggarbetsplatsen. Sortering på annat ställe är endast ett alternativ om det inte är möjligt att göra på byggarbetsplatsen, vilket i så fall ska motiveras.  \n3. Detta ska kvantifieras och följas upp under byggskedet och redovisas i planen för avfallshantering vid färdigställandet. \n\nKriterier för exemplarisk nivå\nNedan beskrivs kriterier för en innovationspoäng för denna BREEAM-indikator. \n1. Alla tre poängen har uppnåtts. \n2. Alla viktiga avfallskategorier som styrs bort från deponi är identifierade i planen för avfallshantering. \n3. Minst fem av de viktiga avfallskategorierna har reduceringspotential vid projekteringsskedet (check-lista A15b). Dessa ska följas upp under hela byggskedet som en del av implementeringen av planen för avfallshantering. Uppnådda resultat ska redovisas i planen för avfallshantering vid färdig-ställande.\n4. Minst basnivåerna för avfallsfraktioner har identifierade att styras bort från deponi: (Avfallsfraktioner vid rivning - basnivå) enligt Kretsloppsrådets riktlinjer för avfallshantering vid byggande och rivning, \n\nByggnader som uppfyller kriterierna för exemplarisk nivå erhåller fyra poäng i denna indikator.",{"$f":"$D$107","v":"One credit where evidence provided demonstrates that a site waste management plan has been developed and implemented. Two credits where evidence provided demonstrates that the first credit has been achieved and waste reduction is a key priority of the site waste management plan. Three credits where evidence provided demonstrates that a significant majority of non-hazardous construction waste generated by the development will be diverted from landfill and reused or recycled."},null,{"$f":"IF(HC=\"y\",AE107,+IF(Ret=\"y\",AG107,+IF(OFF=\"y\",AI107,+IF(TOYOTA=\"y\",AU107,+IF(PRISONS=\"y\",AM107,+IF(SCHOOLS=\"y\",AO107,+IF(FE=\"y\",AQ107,+IF(INDUSTRIAL=\"y\",AS107))))))))","v":3},null,null,null,null,{"$f":"IF(partnewpartrefurb=\"y\",Q107,0)","v":0},null,null,null,{"$f":"IF(OR(islike($V107,\"*2*\"),islike($V107,\"*1B*\")),EY107*0.5,EY107)","v":{"$error":"#NAME?"}},{"$f":"IF(OR(islike($V107,\"*2*\"),islike($V107,\"*1B*\")),EZ107*0.5,EZ107)","v":{"$error":"#NAME?"}},{"$f":"IF(OR(islike($V107,\"*2*\"),islike($V107,\"*1B*\")),FA107*0.5,FA107)","v":{"$error":"#NAME?"}},{"$f":"IF(OR(islike($V107,\"*2*\"),islike($V107,\"*1B*\")),FB107*0.5,FB107)","v":{"$error":"#NAME?"}},{"$f":"IF(OR(islike($V107,\"*2*\"),islike($V107,\"*1B*\")),FC107*0.5,FC107)","v":{"$error":"#NAME?"}},null,null,null,null,{"$f":"IF(DP107=\"y\",AH107,0)","v":3},3,{"$f":"IF(CB107=\"y\",AJ107,0)","v":3},3,null,null,null,null,null,null,null,null,{"$f":"IF(EV107=\"y\",AT107,0)","v":3},3,{"$f":"IF(DP107=\"y\",AV107,0)","v":3},3,null,null,null,null,1,null,null,null,null,null,null,null,null,null,null,null,null,null,1,"Y",null,1,null,null,null,null,null,null,null,null,1,"Y",null,1,null,null,1,"Y",null,1,null,null,null,null,null,null,null,1,"Y",null,1,null,null,null,null,null,null,null,null,null,null,null,null,null,null,null,null,null,null,null,1,"Y",null,1,null,null,null,null,null,null,null,null,null,null,1,"Y",null,1,null,null,null,null,null,null,null,null,null,null,null,null,null,null,1,"Y",null,null,0,0,0,0,0]
[null,"Wst 1","Construction Site Waste Management - Fit Out only",null,null,"One credit where evidence provided demonstrates that waste generated by the fit-out works will be sorted, separated into key waste groups and measured.\n\nOne credit where evidence provided demonstrates that the majority of non-hazardous construction waste generated by the fit-out works will be diverted from landfill and reused or recycled.","One credit where evidence provided demonstrates that waste generated by the fit-out works will be sorted, separated into key waste groups and measured.\n\nOne credit where evidence provided demonstrates that the majority of non-hazardous construction waste generated by the fit-out works will be diverted from landfill and reused or recycled.","N/A",null,null,null,"One credit where evidence provided demonstrates that waste generated by the fit-out works will be sorted, separated into key waste groups and measured.\n\nOne credit where evidence provided demonstrates that the majority of non-hazardous construction waste generated by the fit-out works will be diverted from landfill and reused or recycled.","One credit where evidence provided demonstrates that waste generated by the fit-out works will be sorted, separated into key waste groups and measured.\n\nOne credit where evidence provided demonstrates that the majority of non-hazardous construction waste generated by the fit-out works will be diverted from landfill and reused or recycled.",null,0,null,null,null,null,{"$f":"IF(partnewpartrefurb=\"y\",Q108,0)","v":0},null,null,null,{"$error":"#NAME?"},{"$error":"#NAME?"},{"$error":"#NAME?"},{"$error":"#NAME?"},{"$error":"#NAME?"},null,null,null,null,0,3,0,3,null,null,null,null,null,null,null,null,0,3,0,3,null,null,null,null,null,null,null,null,null,null,null,null,null,null,null,null,null,null,{"$f":"SUM(BA108:BN108)","v":0},"N",null,null,null,null,null,null,null,null,null,null,0,"N",null,0,null,null,0,"N",null,0,null,null,null,null,null,null,null,0,"N",null,null,null,null,null,null,null,null,null,null,null,null,null,null,null,null,null,null,null,null,null,0,"N",null,0,null,null,null,null,null,null,null,null,null,null,0,"N",null,null,null,null,null,null,null,null,null,null,null,null,null,null,null,null,0,"N",null,null,0,0,0,0,0]
[null,"Wst 2","Återvunnet fyllnadsmaterial","One credit where evidence provided demonstrates the significant use of recycled or\nsecondary aggregates in ‘high-grade’ building aggregate uses.",null,"1. Specificerad mängd återvunnet och sekundärt fyllnadsmaterial är större än 25 % (vikt eller volym) av total mängd högkvalitativt fyllnadsmaterial som används för byggnaden. Sådant fyllnadsmaterial kan vara ANTINGEN\na. Hämtat från platsen ELLER\nb. Hämtat från en plats för bearbetning av avfall på ett avstånd lika med eller kortare än till den plats där råmaterial kunde ha hämtats ELLER\nc. Hämtat på en plats för avfallsbearbetning inom en radie på högst eller lika med 30 km från byggarbetsplatsen då råmaterial kan hämtas på närmare håll eller på större avstånd men transporterat med järnväg eller båt till byggarbetsplatsen. Källa är huvudsakligen byggnation, rivning eller schaktning - inklusive vägplanläggning.\nd. Sekundärt fyllnadsmaterial erhållet från icke-byggande postkonsumtion eller postindustriella restprodukter (se Tolkning av bedömningskriterier). Innan användning fastställs att förorenings-halten i de sekundära fyllnadsmaterialen inte överskrider aktuella gränsvärden. ","1. Specificerad mängd återvunnet och sekundärt fyllnadsmaterial är större än 25 % (vikt eller volym) av total mängd högkvalitativt fyllnadsmaterial som används för byggnaden. Sådant fyllnadsmaterial kan vara ANTINGEN\na. Hämtat från platsen ELLER\nb. Hämtat från en plats för bearbetning av avfall på ett avstånd lika med eller kortare än till den plats där råmaterial kunde ha hämtats ELLER\nc. Hämtat på en plats för avfallsbearbetning inom en radie på högst eller lika med 30 km från byggarbetsplatsen då råmaterial kan hämtas på närmare håll eller på större avstånd men transporterat med järnväg eller båt till byggarbetsplatsen. Källa är huvudsakligen byggnation, rivning eller schaktning - inklusive vägplanläggning.\nd. Sekundärt fyllnadsmaterial erhållet från icke-byggande postkonsumtion eller postindustriella restprodukter (se Tolkning av bedömningskriterier). Innan användning fastställs att föroreningshalten i de sekundära fyllnadsmaterialen inte överskrider aktuella gränsvärden. ",{"$f":"$D109","v":"One credit where evidence provided demonstrates the significant use of recycled or\nsecondary aggregates in ‘high-grade’ building aggregate uses."},null,null,null,"1. Specificerad mängd återvunnet och sekundärt fyllnadsmaterial är större än 25 % (vikt eller volym) av total mängd högkvalitativt fyllnadsmaterial som används för byggnaden. Sådant fyllnadsmaterial kan vara ANTINGEN\na. Hämtat från platsen ELLER\nb. Hämtat från en plats för bearbetning av avfall på ett avstånd lika med eller kortare än till den plats där råmaterial kunde ha hämtats ELLER\nc. Hämtat på en plats för avfallsbearbetning inom en radie på högst eller lika med 30 km från byggarbetsplatsen då råmaterial kan hämtas på närmare håll eller på större avstånd men transporterat med järnväg eller båt till byggarbetsplatsen. Källa är huvudsakligen byggnation, rivning eller schaktning - inklusive vägplanläggning.\nd. Sekundärt fyllnadsmaterial erhållet från icke-byggande postkonsumtion eller postindustriella restprodukter (se Tolkning av bedömningskriterier). Innan användning fastställs att föroreningshalten i de sekundära fyllnadsmaterialen inte överskrider aktuella gränsvärden. ",{"$f":"$D109","v":"One credit where evidence provided demonstrates the significant use of recycled or\nsecondary aggregates in ‘high-grade’ building aggregate uses."},null,0,null,null,null,null,{"$f":"IF(partnewpartrefurb=\"y\",(Q109*$Q$16)+(R109*$R$16),0)","v":0},null,null,null,{"$error":"#NAME?"},{"$error":"#NAME?"},{"$error":"#NAME?"},{"$error":"#NAME?"},{"$error":"#NAME?"},null,null,null,null,0,1,0,1,null,null,null,null,null,null,null,null,0,1,0,1,null,null,null,null,1,null,null,null,null,null,null,null,null,null,null,null,null,null,1,"Y",null,null,{"$f":"IF(Offnewrefurb=\"y\",1,0)","v":0},null,null,null,null,null,null,null,0,"N",null,1,null,null,1,"Y",null,1,null,null,null,null,null,null,null,1,"Y",null,null,{"$f":"IF(RETnewrefurb=\"y\",1,0)","v":0},null,null,null,null,null,null,null,null,null,null,null,null,null,null,null,null,null,null,0,"N",null,1,null,null,null,null,null,null,null,null,null,null,1,"Y",null,null,{"$f":"IF(INDnewrefurb=\"y\",1,0)","v":0},null,null,null,null,null,null,null,null,null,null,null,null,null,0,"N",null,null,0,0,0,0,0]
[null,"Wst 3","Utrymme för återvinningsbart avfall","One credit where a central, dedicated space is provided for the storage of the building’s recyclable waste streams.",null,"1. Utrymme reserveras för det återvinningsbara material som genereras under byggnadens drift. Det ska uppfylla följande:\na. Tydligt märkt för återvinning\nb. Placerat så att det är lätt åtkomlig för byggnadens brukare (se Tolkning av bedömningskriterier)\nc. Placeras så att det blir lättillgänglighet för fordon för att underlätta hämtning av avfall. \n2. Det reserverade utrymmet ska vara så stort att det rymmer den mängd återvinningsbart avfall som byggnadens brukare och drift förväntas generera. Om inte en bestämd area kan uppges, ska föl-jande minimikrav vara uppfyllda: \n\nENDAST KONTOR\na. Minst 2 m2 per 1 000 m2 ”net floor area” för byggnader < 5000 m2\nb. Minimum 10 m2 för byggnader ≥ 5 000 m2\nc. Ett tillägg på 2 m2 per 1 000 m2 om storkök ingår (minst 10 m2 tillägg för byggnader ≥ 5 000 m2).\n\nENDAST INDUSTRI\na. En del av utrymmet ska ha hårt underlag för effektiv hantering av återvunnet material genererats av verksamheten \nOCH \nb. Minst 2 m2 per 1 000 m2 ”net floor area”  för kontorsbyggnader <5 000 m2, minst 10m2 tillägg för byggnader ≥ 5 000 m2\nc. Reserverat utrymme ska kunna användas för sortering och förvaring av återvinningsbart material som är genererat av slutanvändaren enligt producentansvar och/eller lokala krav. Se manualen för fraktioner.\n\nENDAST HANDEL\na. Utrymmets storlek beror på handelsenheternas antal och storlek och förväntad volym genererat avfall.\nb. Det reserverade utrymmet ska kunna användas för sortering och förvaring av minst sex typer av återvinningsbart material och relevant farligt avfall enligt producentansvar och/eller krav från lokalt hämtningssystem. Se manualen för fraktioner.\n\nNotera: Vid bedömning av byggnader/enheter för tjänsteleverantörer hänvisas till Tolkning av bedömningskriterier.","1. Utrymme reserveras för det återvinningsbara material som genereras under byggnadens drift. Det ska uppfylla följande:\na. Tydligt märkt för återvinning\nb. Placerat så att det är lätt åtkomlig för byggnadens brukare (se Tolkning av bedömningskriterier)\nc. Placeras så att det blir lättillgänglighet för fordon för att underlätta hämtning av avfall. \n2. Det reserverade utrymmet ska vara så stort att det rymmer den mängd återvinningsbart avfall som byggnadens brukare och drift förväntas generera. Om inte en bestämd area kan uppges, ska föl-jande minimikrav vara uppfyllda: \n\nENDAST KONTOR\na. Minst 2 m2 per 1 000 m2 ”net floor area” för byggnader < 5000 m2\nb. Minimum 10 m2 för byggnader ≥ 5 000 m2\nc. Ett tillägg på 2 m2 per 1 000 m2 om storkök ingår (minst 10 m2 tillägg för byggnader ≥ 5 000 m2).\n\nENDAST INDUSTRI\na. En del av utrymmet ska ha hårt underlag för effektiv hantering av återvunnet material genere-rats av verksamheten \nOCH \nb. Minst 2 m2 per 1 000 m2 ”net floor area”  för kontorsbyggnader <5 000 m2, minst 10m2 tillägg för byggnader ≥ 5 000 m2\nc. Reserverat utrymme ska kunna användas för sortering och förvaring av återvinningsbart material som är genererat av slutanvändaren enligt producentansvar och/eller lokala krav: \n• Emballage\n• Papper \n• Papp\n• Räfflad papp\n• Plast\n• Metallförpackningar\n• Glasförpackningar\n• Returpapper\n• Elektriskt avfall och elektroniska produkter \n• Ljuskällor \n• Batterier\n• Färg, lack och lim\n• Olja och fetter\n• Lösningsmedel\n• Biocider\n• Övriga kemikalier\n• Sprayflaskor\n• Matavfall\n\nENDAST HANDEL\na. Utrymmets storlek beror på handelsenheternas antal och storlek och förväntad volym genererat avfall.\nb. Det reserverade utrymmet ska kunna användas för sortering och förvaring av minst sex typer av återvinningsbart material och relevant farligt avfall enligt producentansvar och/eller krav från lokalt hämtningssystem. Dessa kan omfatta: \n• Emballage\n• Papper \n• Papp\n• Räfflad papp\n• Plast\n• Metallförpackningar\n• Glasförpackningar\n• Returpapper\n• Elektriskt avfall och elektroniska produkter \n• Ljuskällor \n• Batterier\n• Färg, lack och lim\n• Olja och fetter\n• Lösningsmedel\n• Biocider\n• Övriga kemikalier\n• Sprayflaskor\n• Matavfall\n\nNotera: Vid bedömning av byggnader/enheter för tjänsteleverantörer hänvisas till Tolkning av bedömningskriterier.",{"$f":"$D110","v":"One credit where a central, dedicated space is provided for the storage of the building’s recyclable waste streams."},null,null,null,"1. Utrymme reserveras för det återvinningsbara material som genereras under byggnadens drift. Det ska uppfylla följande:\na. Tydligt märkt för återvinning\nb. Placerat så att det är lätt åtkomlig för byggnadens brukare (se Tolkning av bedömningskriterier)\nc. Placeras så att det blir lättillgänglighet för fordon för att underlätta hämtning av avfall. \n2. Det reserverade utrymmet ska vara så stort att det rymmer den mängd återvinningsbart avfall som byggnadens brukare och drift förväntas generera. Om inte en bestämd area kan uppges, ska följande minimikrav vara uppfyllda: \n\nENDAST KONTOR\na. Minst 2 m2 per 1 000 m2 ”net floor area” för byggnader < 5000 m2\nb. Minimum 10 m2 för byggnader ≥ 5 000 m2\nc. Ett tillägg på 2 m2 per 1 000 m2 om storkök ingår (minst 10 m2 tillägg för byggnader ≥ 5 000 m2).\n\nENDAST INDUSTRI\na. En del av utrymmet ska ha hårt underlag för effektiv hantering av återvunnet material genererats av verksamheten \nOCH \nb. Minst 2 m2 per 1 000 m2 ”net floor area”  för kontorsbyggnader <5 000 m2, minst 10m2 tillägg för byggnader ≥ 5 000 m2\nc. Reserverat utrymme ska kunna användas för sortering och förvaring av återvinningsbart material som är genererat av slutanvändaren enligt producentansvar och/eller lokala krav: \n• Emballage\n• Papper \n• Papp\n• Räfflad papp\n• Plast\n• Metallförpackningar\n• Glasförpackningar\n• Returpapper\n• Elektriskt avfall och elektroniska produkter \n• Ljuskällor \n• Batterier\n• Färg, lack och lim\n• Olja och fetter\n• Lösningsmedel\n• Biocider\n• Övriga kemikalier\n• Sprayflaskor\n• Matavfall\n\nENDAST HANDEL\na. Utrymmets storlek beror på handelsenheternas antal och storlek och förväntad volym genererat avfall.\nb. Det reserverade utrymmet ska kunna användas för sortering och förvaring av minst sex typer av återvinningsbart material och relevant farligt avfall enligt producentansvar och/eller krav från lokalt hämtningssystem. Dessa kan omfatta: \n• Emballage\n• Papper \n• Papp\n• Räfflad papp\n• Plast\n• Metallförpackningar\n• Glasförpackningar\n• Returpapper\n• Elektriskt avfall och elektroniska produkter \n• Ljuskällor \n• Batterier\n• Färg, lack och lim\n• Olja och fetter\n• Lösningsmedel\n• Biocider\n• Övriga kemikalier\n• Sprayflaskor\n• Matavfall\n\nNotera: Vid bedömning av byggnader/enheter för tjänsteleverantörer hänvisas till Tolkning av bedömningskriterier.",{"$f":"$D110","v":"One credit where a central, dedicated space is provided for the storage of the building’s recyclable waste streams."},null,1,null,null,null,null,{"$f":"IF(partnewpartrefurb=\"y\",Q110,0)","v":0},null,null,null,{"$error":"#NAME?"},{"$error":"#NAME?"},{"$error":"#NAME?"},{"$error":"#NAME?"},{"$error":"#NAME?"},null,null,null,null,1,1,1,1,null,null,null,null,null,null,null,null,1,1,1,1,null,null,null,null,1,null,null,null,null,null,null,null,null,null,null,null,null,null,1,"Y",null,1,null,null,null,null,null,null,null,null,1,"Y",null,1,null,null,1,"Y",null,1,null,null,null,null,null,null,null,1,"Y",null,1,null,null,null,null,null,null,null,null,null,null,null,null,null,null,null,null,null,null,null,1,"Y",null,1,null,null,null,null,null,null,null,null,null,null,1,"Y",null,1,null,null,null,null,null,null,null,null,null,null,null,null,null,null,{"$f":"SUM(EF110:ET110)","v":1},"Y",null,null,0,0,0,1,1]
[null,"Wst 4","Avfallskomprimator","One credit where evidence provided demonstrates that either an industrial waste compactor or baler is installed for compacting/baling waste materials generated on site and\na. A water outlet is provided for cleaning\nb. The development achieves the BREEAM credit for storage of recyclable waste.",null,"1. En stationär avfallskomprimator eller avfallspress installeras och placeras i serviceutrymme eller i ett särskilt för avfallshantering.\n2. Det finns minst ett vattenuttag och motsvarande avlopp till varje sorterings- och/eller förvaringsfacilitet\n3. Kraven på utrymme för återvinningsbart avfall enligt Wst 3 är uppfyllda.\n\nELLER\n4.  En vakuumanläggning är installerad som kan ta hand om relevanta avfallsfraktioner, enligt Wst 3.","1. En stationär avfallskomprimator eller avfallspress installeras och placeras i serviceutrymme eller i ett särskilt för avfallshantering.\n2. Det finns minst ett vattenuttag och motsvarande avlopp till varje sorterings- och/eller förvaringsfacilitet\n3. Kraven på utrymme för återvinningsbart avfall enligt Wst 3 är uppfyllda.\n\nELLER\n4.  En vakuumanläggning är installerad som kan ta hand om relevanta avfallsfraktioner, enligt Wst 3.",null,null,null,null,"1. En stationär avfallskomprimator eller avfallspress installeras och placeras i serviceutrymme eller i ett särskilt för avfallshantering.\n2. Det finns minst ett vattenuttag och motsvarande avlopp till varje sorterings- och/eller förvaringsfacilitet\n3. Kraven på utrymme för återvinningsbart avfall enligt Wst 3 är uppfyllda.\n\nELLER\n4.  En vakuumanläggning är installerad som kan ta hand om relevanta avfallsfraktioner, enligt Wst 3.",{"$f":"$D111","v":"One credit where evidence provided demonstrates that either an industrial waste compactor or baler is installed for compacting/baling waste materials generated on site and\na. A water outlet is provided for cleaning\nb. The development achieves the BREEAM credit for storage of recyclable waste."},null,0,null,null,null,null,{"$f":"IF(partnewpartrefurb=\"y\",Q111,0)","v":0},null,null,null,{"$error":"#NAME?"},{"$error":"#NAME?"},{"$error":"#NAME?"},{"$error":"#NAME?"},{"$error":"#NAME?"},null,null,null,null,0,1,0,0,null,null,null,null,null,null,null,null,0,1,0,1,null,null,null,null,null,{"$f":"IF(teachhospital=\"Y\",1,0)","v":0},{"$f":"IF(acutehospital=\"Y\",1,0)","v":0},null,null,null,null,null,null,{"$f":"IF(largehc=\"Y\",1,0)","v":0},null,null,null,null,0,"N",null,0,null,null,null,null,null,null,null,null,0,"N",null,0,null,null,0,"N",null,1,null,null,null,null,null,null,null,1,"Y",null,null,null,null,null,null,null,null,null,null,{"$f":"IF(RETlarge=\"y\",1,0)","v":0},null,null,null,null,null,null,null,null,{"$f":"IF(RETwastemanagement=\"y\",1,0)","v":0},null,0,"N",null,0,null,null,null,null,null,null,null,null,null,null,0,"N",null,null,null,null,null,{"$f":"IF(INDmedlarge=\"y\",1,0)","v":0},null,null,null,null,null,null,null,null,{"$f":"IF(INDwasteman=\"y\",1,0)","v":0},null,0,"N",null,null,0,0,0,0,0]
[null,"Wst 5","Kompostering och rötning","One credit where evidence provided demonstrates there is a vessel on site for composting food waste, and adequate storage for such waste generated by the building’s users and operation.\n\nOR\n\nWhere space or access is limited, there is a dedicated space for compostable\nfood waste to be stored prior to removal and composting at an alternative site.",null," Alternativ 1\n1. Utrustning finns för kompostering av matavfall från byggnadens dagliga drift och användning.\n2. Det finns tillräckligt utrymme för förvaring av sorterat matavfall och kompostering av organiskt material.\n3. Det finns minst ett vattenuttag för rengöring av och omkring utrustningen.\n\nAlternativ 2\n1. Det finns reserverat ett särskilt utrymme för förvaring av komposterbart matavfall som hämtas till en anläggning för biologisk behandling (kompostering eller rötning)\n2. Det finns minst ett vattenuttag för rengöring av och omkring utrustningen.","Alternativ 1\n1. Utrustning finns för kompostering av matavfall från byggnadens dagliga drift och användning.\n2. Det finns tillräckligt utrymme för förvaring av sorterat matavfall och kompostering av organiskt material.\n3. Det finns minst ett vattenuttag för rengöring av och omkring utrustningen.\n\nAlternativ 2\n1. Det finns reserverat ett särskilt utrymme för förvaring av komposterbart matavfall som hämtas till en anläggning för biologisk behandling (kompostering eller rötning)\n2. Det finns minst ett vattenuttag för rengöring av och omkring utrustningen.","N/A",null,null,null," Alternativ 1\n1. Utrustning finns för kompostering av matavfall från byggnadens dagliga drift och användning.\n2. Det finns tillräckligt utrymme för förvaring av sorterat matavfall och kompostering av organiskt material.\n3. Det finns minst ett vattenuttag för rengöring av och omkring utrustningen.\n\nAlternativ 2\n1. Det finns reserverat ett särskilt utrymme för förvaring av komposterbart matavfall som hämtas till en anläggning för biologisk behandling (kompostering eller rötning)\n2. Det finns minst ett vattenuttag för rengöring av och omkring utrustningen.",{"$f":"$D$112","v":"One credit where evidence provided demonstrates there is a vessel on site for composting food waste, and adequate storage for such waste generated by the building’s users and operation.\n\nOR\n\nWhere space or access is limited, there is a dedicated space for compostable\nfood waste to be stored prior to removal and composting at an alternative site."},null,1,null,null,null,null,{"$f":"IF(partnewpartrefurb=\"y\",Q112,0)","v":0},null,null,null,{"$error":"#NAME?"},{"$error":"#NAME?"},{"$error":"#NAME?"},{"$error":"#NAME?"},{"$error":"#NAME?"},null,null,null,null,0,1,1,1,null,null,null,null,null,null,null,null,0,1,0,0,null,null,null,null,null,null,null,null,null,null,null,null,null,null,null,{"$f":"IF(HCfoodprep=\"y\",1,0)","v":0},null,null,0,"N",null,null,null,null,null,null,{"$f":"IF(OFFfoodprep=\"y\",1,0)","v":1},{"$f":"IF(OFFserdin=\"y\",1,0)","v":0},null,null,1,"Y",null,0,null,null,0,"N",null,null,{"$f":"IF(PRIfoodprep=\"y\",1,0)","v":0},null,null,null,null,null,null,0,"N",null,null,null,null,null,{"$f":"IF(Retfood=\"y\",1,0)","v":0},{"$f":"IF(RETfoodprep=\"y\",1,0)","v":0},null,null,null,null,{"$f":"IF(TOYOTA=\"y\",0,+IF(Retcommercialfoodprep=\"y\",1,0))","v":0},null,null,null,null,null,null,null,null,null,0,"N",null,0,null,null,null,null,null,null,null,null,null,null,0,"N",null,null,null,null,null,null,null,null,null,{"$f":"IF(INDfoodprep=\"y\",1,0)","v":0},null,null,null,null,null,null,0,"N",null,null,0,0,0,0,0]
[null,"Wst 6","Ytskikt på golv",null,null,"Stimulera till att framtida brukare själva specificerar ytskikt på golv för att inte i onödan slösa med\nmaterial.\n1. I uthyrda delar (om framtida hyresgäster är okända) och innan inredningsarbetet startar, finns mattor\noch andra golvytskikt i endast ett visningsutrymme.\n2. I en byggnad uppförd för en viss brukare har denna själv valt (eller godkänt) de specificerade golvytskikten.","Stimulera till att framtida brukare själva specificerar ytskikt på golv för att inte i onödan slösa med\nmaterial.\n1. I uthyrda delar (om framtida hyresgäster är okända) och innan inredningsarbetet startar, finns mattor\noch andra golvytskikt i endast ett visningsutrymme.\n2. I en byggnad uppförd för en viss brukare har denna själv valt (eller godkänt) de specificerade golvytskikten.","N/A",null,null,null,"N/A","N/A",null,{"$f":"IF(HC=\"y\",AE113,+IF(Ret=\"y\",AG113,+IF(OFF=\"y\",AI113,+IF(TOYOTA=\"y\",AU113,+IF(PRISONS=\"y\",AM113,+IF(SCHOOLS=\"y\",AO113,+IF(FE=\"y\",AQ113,+IF(INDUSTRIAL=\"y\",AS113))))))))","v":0},null,null,null,null,{"$f":"IF(partnewpartrefurb=\"y\",(Q113*$Q$16)+(R113*$R$16),0)","v":0},null,null,null,{"$error":"#NAME?"},{"$error":"#NAME?"},{"$error":"#NAME?"},{"$error":"#NAME?"},{"$error":"#NAME?"},null,null,null,null,0,0,0,1,null,null,null,null,null,null,null,null,0,0,0,0,null,null,null,null,null,null,null,null,null,null,null,null,null,null,null,null,null,null,0,"N",null,null,null,{"$f":"IF(OFFfitout=\"y\",0,1)","v":0},null,null,null,null,null,null,0,{"$f":"IF(CA113>=0.1,\"Y\",\"N\")","v":"N"},null,0,null,null,0,"N",null,0,null,null,null,null,null,null,null,0,"N",null,0,null,0,null,null,null,null,null,null,null,null,null,null,null,null,null,null,null,null,null,0,"N",null,0,null,null,null,null,null,null,null,null,null,null,0,"N",null,0,null,0,null,null,null,null,null,null,null,null,null,null,null,null,0,"N",null,null,0,0,0,0,0]
[null,"Mark och Ekologi"]
[null,"LE1","Återanvändning av mark","One credit where evidence provided  demonstrates that the majority of the footprint of\nthe proposed development falls within the boundary of previously developed\nland.",null,"1. Minst 75 % av det föreslagna projektets avtryck är på tidigare bebyggd mark  och används för industri, handel eller bostäder under de senaste 50 åren.","1. Minst 75 % av det föreslagna projektets avtryck är på tidigare bebyggd mark  och används för industri, handel eller bostäder under de senaste 50 åren.",{"$f":"$D115","v":"One credit where evidence provided  demonstrates that the majority of the footprint of\nthe proposed development falls within the boundary of previously developed\nland."},null,null,null,"1. Minst 75 % av det föreslagna projektets avtryck är på tidigare bebyggd mark  och används för industri, handel eller bostäder under de senaste 50 åren.",{"$f":"$D115","v":"One credit where evidence provided  demonstrates that the majority of the footprint of\nthe proposed development falls within the boundary of previously developed\nland."},null,{"$f":"IF(HC=\"y\",AE115,+IF(Ret=\"y\",AG115,+IF(OFF=\"y\",AI115,+IF(TOYOTA=\"y\",AU115,+IF(PRISONS=\"y\",AM115,+IF(SCHOOLS=\"y\",AO115,+IF(FE=\"y\",AQ115,+IF(INDUSTRIAL=\"y\",AS115))))))))","v":0},null,null,null,null,{"$f":"IF(partnewpartrefurb=\"y\",Q115,0)","v":0},null,null,null,{"$f":"IF(OR(islike($V115,\"*2*\"),islike($V115,\"*1B*\")),EY115*0.5,EY115)","v":{"$error":"#NAME?"}},{"$f":"IF(OR(islike($V115,\"*2*\"),islike($V115,\"*1B*\")),EZ115*0.5,EZ115)","v":{"$error":"#NAME?"}},{"$f":"IF(OR(islike($V115,\"*2*\"),islike($V115,\"*1B*\")),FA115*0.5,FA115)","v":{"$error":"#NAME?"}},{"$f":"IF(OR(islike($V115,\"*2*\"),islike($V115,\"*1B*\")),FB115*0.5,FB115)","v":{"$error":"#NAME?"}},{"$f":"IF(OR(islike($V115,\"*2*\"),islike($V115,\"*1B*\")),FC115*0.5,FC115)","v":{"$error":"#NAME?"}},null,null,null,null,{"$f":"IF(DP115=\"y\",AH115,0)","v":0},1,{"$f":"IF(CB115=\"y\",AJ115,0)","v":0},1,null,null,null,null,null,null,null,null,{"$f":"IF(EV115=\"y\",AT115,0)","v":0},1,{"$f":"IF(DP115=\"y\",AV115,0)","v":0},1,null,null,null,null,1,null,null,null,null,null,null,null,null,null,null,null,null,null,1,"Y",null,null,{"$f":"IF(Offnewrefurb=\"y\",1,0)","v":0},null,null,null,null,null,null,null,0,"N",null,1,null,null,1,"Y",null,1,null,null,null,null,null,null,null,1,"Y",null,null,{"$f":"IF(RETnewrefurb=\"y\",1,0)","v":0},null,null,null,null,null,null,null,null,null,null,null,null,null,null,null,null,null,null,0,"N",null,1,null,null,null,null,null,null,null,null,null,null,1,"Y",null,null,{"$f":"IF(INDnewrefurb=\"y\",1,0)","v":0},null,null,null,null,null,null,null,null,null,null,null,null,null,0,"N",null,null,0,0,0,0,0]
[null,"LE2","Förorenad mark","One credit is awarded where evidence  provided demonstrates that the land used for the new development has, prior to development, been defined as contaminated and where adequate remedial steps have been taken to decontaminate the site prior to construction.",null,"1. Risken för föroreningar på tomten identifieras med hjälp av checklista A16a, och den mest krä-vande av följande har använts.\n• Nationellt erkända strategier för återtagning har följts\nELLER\n• En specialist på förorenad mark har genomfört en tomtundersökning, riskvärdering och bedömning med avseende på föroreningar. Dessa omfattar minst kraven i checklista A16b. \n2. Om ovanstående tomtundersökning, riskvärdering och bedömning visar att marken har betydande föroreningar, ska byggherre eller entreprenör bekräfta att sanering kommer att genomföras enligt rekommenderade saneringsdirektiv och att en åtgärdsplan utarbetas av en specialist på förorenad mark inkluderande alla nationella och andra relevant lagstiftningar.","1. Risken för föroreningar på tomten identifieras med hjälp av checklista A16a, och den mest krävande av följande har använts.\n• Nationellt erkända strategier för återtagning har följts\nELLER\n• En specialist på förorenad mark har genomfört en tomtundersökning, riskvärdering och bedömning med avseende på föroreningar. Dessa omfattar minst kraven i checklista A16b. \n2. Om ovanstående tomtundersökning, riskvärdering och bedömning visar att marken har betydande föroreningar, ska byggherre eller entreprenör bekräfta att sanering kommer att genomföras enligt rekommenderade saneringsdirektiv och att en åtgärdsplan utarbetas av en specialist på förorenad mark inkluderande alla nationella och andra relevant lagstiftningar.",{"$f":"$D116","v":"One credit is awarded where evidence  provided demonstrates that the land used for the new development has, prior to development, been defined as contaminated and where adequate remedial steps have been taken to decontaminate the site prior to construction."},null,null,null,"1. Risken för föroreningar på tomten identifieras med hjälp av checklista A16a, och den mest krä-vande av följande har använts.\n• Nationellt erkända strategier för återtagning har följts\nELLER\n• En specialist på förorenad mark har genomfört en tomtundersökning, riskvärdering och bedöm-ning med avseende på föroreningar. Dessa omfattar minst kraven i checklista A16b. \n2. Om ovanstående tomtundersökning, riskvärdering och bedömning visar att marken har betydande föroreningar, ska byggherre eller entreprenör bekräfta att sanering kommer att genomföras enligt rekommenderade saneringsdirektiv och att en åtgärdsplan utarbetas av en specialist på förorenad mark inkluderande alla nationella och andra relevant lagstiftningar.",{"$f":"$D116","v":"One credit is awarded where evidence  provided demonstrates that the land used for the new development has, prior to development, been defined as contaminated and where adequate remedial steps have been taken to decontaminate the site prior to construction."},null,0,null,null,null,null,0,null,null,null,{"$error":"#NAME?"},{"$error":"#NAME?"},{"$error":"#NAME?"},{"$error":"#NAME?"},{"$error":"#NAME?"},null,null,null,null,0,1,0,1,null,null,null,null,null,null,null,null,0,1,0,1,null,null,null,null,1,null,null,null,null,null,null,null,null,null,null,null,null,null,1,"Y",null,null,0,null,null,null,null,null,null,null,0,"N",null,1,null,null,1,"Y",null,1,null,null,null,null,null,null,null,1,"Y",null,null,0,null,null,null,null,null,null,null,null,null,null,null,null,null,null,null,null,null,null,0,"N",null,1,null,null,null,null,null,null,null,null,null,null,1,"Y",null,null,0,null,null,null,null,null,null,null,null,null,null,null,null,null,0,"N",null,null,0,0,0,0,0]
[null,"LE3","Platsens ekologiska värde","One credit is awarded where evidence  provided demonstrates that the construction zone is defined as land of low ecological value and all existing features of ecological value will be fully protected from damage during site preparation and construction works.",null,"1. Mark inom byggområdet definieras som \"mark med lågt ekologiskt värde\" enligt:\na. BREEAM-checklista A4 \nELLER\nb. en sakkunnig ekolog har identifierat marken som av \"lågt ekologiskt värde\" i en ekologibedömningsrapport baserad på platsundersökningar. \n2. Alla befintliga element av ekologiskt värde kring byggområdet och tomtgränsområdet ska skyddas mot skador under röjning och förberedelse av tomten och byggaktiviteter: \n• Träd med stammar tjockare än 100 mm i diameter, och/eller av betydande ekologiskt värde, förses med avspärrning som förhindrar byggnadsarbete mellan trädstam och denne. Minsta avstånd mellan trädstam och avspärrning är antingen lika med grenarnas utbredning eller trädets halva höjd. Största avstånd gäller. \n• Träd ska alltid skyddas från direkt påverkan och från att rötterna kapas eller kvävs.\n• Häckar och naturområden som behöver skyddas förses antingen med avspärrning eller om de är längre från byggplatsen eller lagerplats, med ett förbud mot byggarbete i närheten. \n• Vattendrag och våtmarker ska skyddas med avskärande dike och dränering för att förhindra avrinning till naturliga vattendrag (som kan innebära förorening, igenslamning och erosion). \n3. Vid alla tillfällen ska entreprenören säkerställa tillräckligt skydd av det ekologiska värdet innan något bygg- och föreberedelsearbeten sätter igång, till exempel innan röjning eller uppförande av tillfälliga faciliteter på tomten.","1. Mark inom byggområdet definieras som \"mark med lågt ekologiskt värde\" enligt:\na. BREEAM-checklista A4 \nELLER\nb. en sakkunnig ekolog har identifierat marken som av \"lågt ekologiskt värde\" i en ekologibedömningsrapport baserad på platsundersökningar. \n2. Alla befintliga element av ekologiskt värde kring byggområdet och tomtgränsområdet ska skyddas mot skador under röjning och förberedelse av tomten och byggaktiviteter: \n• Träd med stammar tjockare än 100 mm i diameter, och/eller av betydande ekologiskt värde, förses med avspärrning som förhindrar byggnadsarbete mellan trädstam och denne. Minsta avstånd mellan trädstam och avspärrning är antingen lika med grenarnas utbredning eller trädets halva höjd. Största avstånd gäller. \n• Träd ska alltid skyddas från direkt påverkan och från att rötterna kapas eller kvävs.\n• Häckar och naturområden som behöver skyddas förses antingen med avspärrning eller om de är längre från byggplatsen eller lagerplats, med ett förbud mot byggarbete i närheten. \n• Vattendrag och våtmarker ska skyddas med avskärande dike och dränering för att för-hindra avrinning till naturliga vattendrag (som kan innebära förorening, igenslamning och erosion). \n3. Vid alla tillfällen ska entreprenören säkerställa tillräckligt skydd av det ekologiska värdet innan nå-got bygg- och föreberedelsearbeten sätter igång, till exempel innan röjning eller uppförande av tillfälliga faciliteter på tomten.",{"$f":"$D117","v":"One credit is awarded where evidence  provided demonstrates that the construction zone is defined as land of low ecological value and all existing features of ecological value will be fully protected from damage during site preparation and construction works."},null,null,null,"1. Mark inom byggområdet definieras som \"mark med lågt ekologiskt värde\" enligt:\na. BREEAM-checklista A4 \nELLER\nb. en sakkunnig ekolog har identifierat marken som av \"lågt ekologiskt värde\" i en ekologibedöm-ningsrapport baserad på platsundersökningar. \n2. Alla befintliga element av ekologiskt värde kring byggområdet och tomtgränsområdet ska skyddas mot skador under röjning och förberedelse av tomten och byggaktiviteter: \n• Träd med stammar tjockare än 100 mm i diameter, och/eller av betydande ekologiskt värde, förses med avspärrning som förhindrar byggnadsarbete mellan trädstam och denne. Minsta avstånd mellan trädstam och avspärrning är antingen lika med grenarnas utbredning eller trädets halva höjd. Största avstånd gäller. \n• Träd ska alltid skyddas från direkt påverkan och från att rötterna kapas eller kvävs.\n• Häckar och naturområden som behöver skyddas förses antingen med avspärrning eller om de är längre från byggplatsen eller lagerplats, med ett förbud mot byggarbete i närheten. \n• Vattendrag och våtmarker ska skyddas med avskärande dike och dränering för att för-hindra avrinning till naturliga vattendrag (som kan innebära förorening, igenslamning och erosion). \n3. Vid alla tillfällen ska entreprenören säkerställa tillräckligt skydd av det ekologiska värdet innan nå-got bygg- och föreberedelsearbeten sätter igång, till exempel innan röjning eller uppförande av tillfälliga faciliteter på tomten.",{"$f":"$D117","v":"One credit is awarded where evidence  provided demonstrates that the construction zone is defined as land of low ecological value and all existing features of ecological value will be fully protected from damage during site preparation and construction works."},null,0,null,null,null,null,0,null,null,null,{"$error":"#NAME?"},{"$error":"#NAME?"},{"$error":"#NAME?"},{"$error":"#NAME?"},{"$error":"#NAME?"},null,null,null,null,0,1,0,1,null,null,null,null,null,null,null,null,0,1,0,1,null,null,null,null,1,null,null,null,null,null,null,null,null,null,null,null,null,null,1,"Y",null,null,0,null,null,null,null,null,null,null,0,"N",null,1,null,null,1,"Y",null,1,null,null,null,null,null,null,null,1,"Y",null,null,0,null,null,null,null,null,null,null,null,null,null,null,null,null,null,null,null,null,null,0,"N",null,1,null,null,null,null,null,null,null,null,null,null,1,"Y",null,null,0,null,null,null,null,null,null,null,null,null,null,null,null,null,0,"N",null,null,0,0,0,0,0]
[null,"LE4","Påverkan på ekologiska värden","One credit where evidence provided demonstrates that the change in the site’s existing\necological value, as a result of development, is minimal.\n\nTwo credits where evidence provided demonstrates that there is no negative change in\nthe site’s existing ecological value as a result of development.",null,"Första poängen\n1. En sakkunnig ekolog anlitas för att utarbeta en rapport om förbättringar och skydd av ekologin på tomten.\na. Sakkunnig ekolog utarbetar en Ekologirapport med relevanta rekommendationer för skydd och förbättring av tomtens ekologi.\nb. Rapporten baseras på sakkunnig ekologs besök/undersökning av tomten före förberedelsearbetet startar på tomten.\n2. De allmänna rekommendationerna i Ekologirapporten beträffande skydd och förbättring av tomtens ekologi har, eller kommer att genomföras. \n\nAndra, tredje, fjärde och femte poängen\n3. Kraven för första poängen är uppfyllda.\n4. Rekommendationer i Ekologirapporten avseende skydd och förbättring av tomtens ekologi har genomförts, och sakkunnig ekolog beräknar ändringen av tomtens ekologiska värde, (x) enligt Tabell 25.\n5. Ökningen av växtarter har beräknats med hjälp av LE 4-verktyget där faktiskt växtartantalet har använts.","Första poängen\n1. En sakkunnig ekolog anlitas för att utarbeta en rapport om förbättringar och skydd av ekologin på tomten.\na. Sakkunnig ekolog utarbetar en Ekologirapport med relevanta rekommendationer för skydd och förbättring av tomtens ekologi.\nb. Rapporten baseras på sakkunnig ekologs besök/undersökning av tomten före förberedelsearbetet startar på tomten.\n2. De allmänna rekommendationerna i Ekologirapporten beträffande skydd och förbättring av tomtens ekologi har, eller kommer att genomföras. \n\nAndra, tredje, fjärde och femte poängen\n3. Kraven för första poängen är uppfyllda.\n4. Rekommendationer i Ekologirapporten avseende skydd och förbättring av tomtens ekologi har genomförts, och sakkunnig ekolog beräknar ändringen av tomtens ekologiska värde, (x) enligt Tabell 25.\n5. Ökningen av växtarter har beräknats med hjälp av LE 4-verktyget där faktiskt växtartantalet har använts.",{"$f":"$D118","v":"One credit where evidence provided demonstrates that the change in the site’s existing\necological value, as a result of development, is minimal.\n\nTwo credits where evidence provided demonstrates that there is no negative change in\nthe site’s existing ecological value as a result of development."},null,null,null,"Första poängen\n1. En sakkunnig ekolog anlitas för att utarbeta en rapport om förbättringar och skydd av ekologin på tomten.\na. Sakkunnig ekolog utarbetar en Ekologirapport med relevanta rekommendationer för skydd och förbättring av tomtens ekologi.\nb. Rapporten baseras på sakkunnig ekologs besök/undersökning av tomten före förberedelsearbetet startar på tomten.\n2. De allmänna rekommendationerna i Ekologirapporten beträffande skydd och förbättring av tomtens ekologi har, eller kommer att genomföras. \n\nAndra, tredje, fjärde och femte poängen\n3. Kraven för första poängen är uppfyllda.\n4. Rekommendationer i Ekologirapporten avseende skydd och förbättring av tomtens ekologi har genomförts, och sakkunnig ekolog beräknar ändringen av tomtens ekologiska värde, (x) enligt Tabell 25.\n5. Ökningen av växtarter har beräknats med hjälp av LE 4-verktyget där faktiskt växtartantalet har använts.",{"$f":"$F118","v":"Första poängen\n1. En sakkunnig ekolog anlitas för att utarbeta en rapport om förbättringar och skydd av ekologin på tomten.\na. Sakkunnig ekolog utarbetar en Ekologirapport med relevanta rekommendationer för skydd och förbättring av tomtens ekologi.\nb. Rapporten baseras på sakkunnig ekologs besök/undersökning av tomten före förberedelsearbetet startar på tomten.\n2. De allmänna rekommendationerna i Ekologirapporten beträffande skydd och förbättring av tomtens ekologi har, eller kommer att genomföras. \n\nAndra, tredje, fjärde och femte poängen\n3. Kraven för första poängen är uppfyllda.\n4. Rekommendationer i Ekologirapporten avseende skydd och förbättring av tomtens ekologi har genomförts, och sakkunnig ekolog beräknar ändringen av tomtens ekologiska värde, (x) enligt Tabell 25.\n5. Ökningen av växtarter har beräknats med hjälp av LE 4-verktyget där faktiskt växtartantalet har använts."},null,0,null,null,null,null,0,null,null,null,{"$error":"#NAME?"},{"$error":"#NAME?"},{"$error":"#NAME?"},{"$error":"#NAME?"},{"$error":"#NAME?"},null,null,null,null,0,5,0,5,null,null,null,null,null,null,null,null,0,5,0,5,null,null,null,null,1,null,null,null,null,null,null,null,null,null,null,null,null,null,1,"Y",null,null,0,null,null,null,null,null,null,null,0,"N",null,1,null,null,1,"Y",null,1,null,null,null,null,null,null,null,1,"Y",null,null,0,null,null,null,null,null,null,null,null,null,null,null,null,null,null,null,null,null,null,0,"N",null,1,null,null,null,null,null,null,null,null,null,null,1,"Y",null,null,0,null,null,null,null,null,null,null,null,null,null,null,null,null,0,"N",null,null,0,0,0,2,2]
[null,"LE5","Enhancing Site Ecology","One credit where the design team (or client) has appointed a suitably qualified ecologist to advise and report on enhancing and protecting the ecological value of the site;\nand implemented the professional’s recommendations for general enhancement\nand protection of site ecology.\n\nTwo credits where, in addition to the above, there is a positive increase in the ecological value of the site of up to (but not including) 6 species.\n\nThree credits where, in addition to the above, evidence is provided to demonstrate a positive increase in the ecological value of the site of 6 species or greater. ",null,"N/A","N/A","One credit where the design team (or client) has appointed a suitably qualified ecologist to report on enhancing and protecting the ecological value of the site.\n\nOne credit where the design team (or client) has implemented the professional’s recommendations for enhancement and protection of site ecology.",null,null,null,"N/A","N/A",null,0,null,null,null,null,0,null,null,null,{"$error":"#NAME?"},{"$error":"#NAME?"},{"$error":"#NAME?"},{"$error":"#NAME?"},{"$error":"#NAME?"},null,null,null,null,0,0,0,0,null,null,null,null,null,null,null,null,0,0,0,0,null,null,null,null,1,null,null,null,null,null,null,null,null,null,null,null,null,null,1,"Y",null,null,null,null,null,null,null,null,null,null,0,"N",null,1,null,null,{"$f":"SUM(CD119:CF119)","v":1},"Y",null,1,null,null,null,null,null,null,null,{"$f":"SUM(CJ119:CQ119)","v":1},"Y",null,null,null,null,null,null,null,null,null,null,null,null,null,null,null,null,null,null,null,null,null,0,"N",null,null,null,null,null,null,null,null,null,null,null,null,{"$f":"SUM(DR119:EB119)","v":0},"N",null,null,null,null,null,null,null,null,null,null,null,null,null,null,null,null,0,"N",null,null,0,0,0,0,0]
[null,"LE6","Långsiktig påverkan av biologisk mångfald","One credit where the client has committed to achieving the mandatory requirements listed in the manual and at least two of the additional requirements.\n\nTwo credits where the client has committed to achieving the mandatory requirements listed in the manual and at least four of the additional requirements.",null,"En poäng kan erhållas om det finns en förpliktelse att uppfylla de obligatoriska kriterierna nedan, och minst två av tilläggskriterierna nedan.\n\nTvå poäng kan erhållas om det finns en förpliktelse att uppfylla de obligatoriska kriterierna nedan och minst fyra av tilläggskriterierna nedan.\n\nObligatoriska kriterier \n1. En sakkunnig ekolog har engagerats innan aktiviteterna på tomten påbörjats.\n2. Sakkunnig ekolog bekräftar att all relevant EU-lagstiftning och nationell lagstiftning vad gäller skydd och förbättring av ekologi följs under projekterings- och byggprocessen.\n3. En förvaltningsplan, anpassad för tomten utarbetas för landskap och livsmiljö. Den ska täcka minst de fem första åren efter projektets slutförande. Planen ska överlämnas till brukarna och omfatta:\n• förvaltning av alla eventuellt skyddade ekologiska särdrag på tomten\n• förvaltning av alla eventuella nya, befintliga eller förbättrade livsmiljöer\n• en referens till befintlig eller framtida tomtnivå eller handlingsplan för biologisk mångfald \n\nTilläggskriterier\n1. Entreprenören utser en \"talesman för biologisk mångfald\", en person med erforderlig auktoritet för att påverka arbetet på byggplatsen och säkerställa att skadlig påverkan på dess biologiska mång-fald begränsas till ett minimum i linje med sakkunnig ekologs rekommendationer.\n2. Entreprenören utbildar arbetsstyrkan i hur ekologin på byggplatsen skyddas under projektet. För att säkerställa medvetenheten ska hela arbetsstyrkan få särskild utbildning i hur skador undviks på byggplatsen ekologi. Utbildningen ska baseras på att skydda de ekologiska särdragen och på de rekommendationer som sakkunnig ekolog har belyst i sin rapport.\n3. Entreprenören dokumenterar de åtgärder som vidtagits för att skydda den biologiska mångfalden och för att övervaka hur effektivt dessa fungerat under de viktigaste faserna av byggskedet. Kravet förbinder entreprenören att göra dessa dokument tillgängliga på begäran av allmänheten.\n4. Ny ekologiskt värdefull livsmiljö skapas relevant för det lokala närområdet. Detta inkluderar livsmil-jöer som stödjer nationell, regional och lokal viktig biologisk mångfald och/eller som i sig själva är nationellt, regionalt eller lokalt viktiga, inklusive livsmiljöer listade som är listade i en lokal hand-lingsplan för biologisk mångfald, livsmiljöer som är skyddad i lag eller livsmiljöer utan lagstöd men som har identifierats i den lokala planen. \n5. Om det finns livsmiljöer för växter och/eller djur på tomten så ska entreprenören planera byggarbe-tet så att växt- och djurliv störs minimalt. Till exempel ska förberedelse av tomt, markarbete och markanläggning planeras så att de utförs under en period så att inte växt- och djurliv störs. Tid-punkten på året kan ha en betydande inverkan på till exempel, häckande fåglar, blommande växter, frögroning, groddjur m.m. Etappvis röjning av vegetationen kan vara en åtgärd som bidrar till att reducera miljöpåverkan. Detta tilläggskrav uppfylls genom att utarbeta en tydlig plan som i detalj beskriver hur och när aktiviteter kommer att genomföras för att undvika påverkan på tomtens biologiska mångfald i linje med sakkunnig ekologs rekommendationer.","En poäng kan erhållas om det finns en förpliktelse att uppfylla de obligatoriska kriterierna nedan, och minst två av tilläggskriterierna nedan.\n\nTvå poäng kan erhållas om det finns en förpliktelse att uppfylla de obligatoriska kriterierna nedan och minst fyra av tilläggskriterierna nedan.\n\nObligatoriska kriterier \n1. En sakkunnig ekolog har engagerats innan aktiviteterna på tomten påbörjats.\n2. Sakkunnig ekolog bekräftar att all relevant EU-lagstiftning och nationell lagstiftning vad gäller skydd och förbättring av ekologi följs under projekterings- och byggprocessen.\n3. En förvaltningsplan, anpassad för tomten utarbetas för landskap och livsmiljö. Den ska täcka minst de fem första åren efter projektets slutförande. Planen ska överlämnas till brukarna och omfatta:\n• förvaltning av alla eventuellt skyddade ekologiska särdrag på tomten\n• förvaltning av alla eventuella nya, befintliga eller förbättrade livsmiljöer\n• en referens till befintlig eller framtida tomtnivå eller handlingsplan för biologisk mångfald \n\nTilläggskriterier\n1. Entreprenören utser en \"talesman för biologisk mångfald\", en person med erforderlig auktoritet för att påverka arbetet på byggplatsen och säkerställa att skadlig påverkan på dess biologiska mångfald begränsas till ett minimum i linje med sakkunnig ekologs rekommendationer.\n2. Entreprenören utbildar arbetsstyrkan i hur ekologin på byggplatsen skyddas under projektet. För att säkerställa medvetenheten ska hela arbetsstyrkan få särskild utbildning i hur skador undviks på byggplatsen ekologi. Utbildningen ska baseras på att skydda de ekologiska särdragen och på de rekommendationer som sakkunnig ekolog har belyst i sin rapport.\n3. Entreprenören dokumenterar de åtgärder som vidtagits för att skydda den biologiska mångfalden och för att övervaka hur effektivt dessa fungerat under de viktigaste faserna av byggskedet. Kravet förbinder entreprenören att göra dessa dokument tillgängliga på begäran av allmänheten.\n4. Ny ekologiskt värdefull livsmiljö skapas relevant för det lokala närområdet. Detta inkluderar livsmil-jöer som stödjer nationell, regional och lokal viktig biologisk mångfald och/eller som i sig själva är nationellt, regionalt eller lokalt viktiga, inklusive livsmiljöer listade som är listade i en lokal hand-lingsplan för biologisk mångfald, livsmiljöer som är skyddad i lag eller livsmiljöer utan lagstöd men som har identifierats i den lokala planen. \n5. Om det finns livsmiljöer för växter och/eller djur på tomten så ska entreprenören planera byggarbe-tet så att växt- och djurliv störs minimalt. Till exempel ska förberedelse av tomt, markarbete och markanläggning planeras så att de utförs under en period så att inte växt- och djurliv störs. Tid-punkten på året kan ha en betydande inverkan på till exempel, häckande fåglar, blommande växter, frögroning, groddjur m.m. Etappvis röjning av vegetationen kan vara en åtgärd som bidrar till att reducera miljöpåverkan. Detta tilläggskrav uppfylls genom att utarbeta en tydlig plan som i detalj beskriver hur och när aktiviteter kommer att genomföras för att undvika påverkan på tomtens biologiska mångfald i linje med sakkunnig ekologs rekommendationer.",{"$f":"$D120","v":"One credit where the client has committed to achieving the mandatory requirements listed in the manual and at least two of the additional requirements.\n\nTwo credits where the client has committed to achieving the mandatory requirements listed in the manual and at least four of the additional requirements."},null,null,null,"En poäng kan erhållas om det finns en förpliktelse att uppfylla de obligatoriska kriterierna nedan, och minst två av tilläggskriterierna nedan.\n\nTvå poäng kan erhållas om det finns en förpliktelse att uppfylla de obligatoriska kriterierna nedan och minst fyra av tilläggskriterierna nedan.\n\nObligatoriska kriterier \n1. En sakkunnig ekolog har engagerats innan aktiviteterna på tomten påbörjats.\n2. Sakkunnig ekolog bekräftar att all relevant EU-lagstiftning och nationell lagstiftning vad gäller skydd och förbättring av ekologi följs under projekterings- och byggprocessen.\n3. En förvaltningsplan, anpassad för tomten utarbetas för landskap och livsmiljö. Den ska täcka minst de fem första åren efter projektets slutförande. Planen ska överlämnas till brukarna och omfatta:\n• förvaltning av alla eventuellt skyddade ekologiska särdrag på tomten\n• förvaltning av alla eventuella nya, befintliga eller förbättrade livsmiljöer\n• en referens till befintlig eller framtida tomtnivå eller handlingsplan för biologisk mångfald \n\nTilläggskriterier\n1. Entreprenören utser en \"talesman för biologisk mångfald\", en person med erforderlig auktoritet för att påverka arbetet på byggplatsen och säkerställa att skadlig påverkan på dess biologiska mång-fald begränsas till ett minimum i linje med sakkunnig ekologs rekommendationer.\n2. Entreprenören utbildar arbetsstyrkan i hur ekologin på byggplatsen skyddas under projektet. För att säkerställa medvetenheten ska hela arbetsstyrkan få särskild utbildning i hur skador undviks på byggplatsen ekologi. Utbildningen ska baseras på att skydda de ekologiska särdragen och på de rekommendationer som sakkunnig ekolog har belyst i sin rapport.\n3. Entreprenören dokumenterar de åtgärder som vidtagits för att skydda den biologiska mångfalden och för att övervaka hur effektivt dessa fungerat under de viktigaste faserna av byggskedet. Kravet förbinder entreprenören att göra dessa dokument tillgängliga på begäran av allmänheten.\n4. Ny ekologiskt värdefull livsmiljö skapas relevant för det lokala närområdet. Detta inkluderar livsmil-jöer som stödjer nationell, regional och lokal viktig biologisk mångfald och/eller som i sig själva är nationellt, regionalt eller lokalt viktiga, inklusive livsmiljöer listade som är listade i en lokal hand-lingsplan för biologisk mångfald, livsmiljöer som är skyddad i lag eller livsmiljöer utan lagstöd men som har identifierats i den lokala planen. \n5. Om det finns livsmiljöer för växter och/eller djur på tomten så ska entreprenören planera byggarbe-tet så att växt- och djurliv störs minimalt. Till exempel ska förberedelse av tomt, markarbete och markanläggning planeras så att de utförs under en period så att inte växt- och djurliv störs. Tid-punkten på året kan ha en betydande inverkan på till exempel, häckande fåglar, blommande växter, frögroning, groddjur m.m. Etappvis röjning av vegetationen kan vara en åtgärd som bidrar till att reducera miljöpåverkan. Detta tilläggskrav uppfylls genom att utarbeta en tydlig plan som i detalj beskriver hur och när aktiviteter kommer att genomföras för att undvika påverkan på tomtens biologiska mångfald i linje med sakkunnig ekologs rekommendationer.",{"$f":"$D120","v":"One credit where the client has committed to achieving the mandatory requirements listed in the manual and at least two of the additional requirements.\n\nTwo credits where the client has committed to achieving the mandatory requirements listed in the manual and at least four of the additional requirements."},null,0,null,null,null,null,0,null,null,null,{"$error":"#NAME?"},{"$error":"#NAME?"},{"$error":"#NAME?"},{"$error":"#NAME?"},{"$error":"#NAME?"},null,null,null,null,0,2,0,2,null,null,null,null,null,null,null,null,0,2,0,2,null,null,null,null,1,null,null,null,null,null,null,null,null,null,null,null,null,null,1,"Y",null,null,0,null,null,null,null,null,null,null,0,"N",null,1,null,null,1,"Y",null,1,null,null,null,null,null,null,null,1,"Y",null,null,0,null,null,null,null,null,null,null,null,null,null,null,null,null,null,null,null,null,null,0,"N",null,1,null,null,null,null,null,null,null,null,null,null,1,"Y",null,null,0,null,null,null,null,null,null,null,null,null,null,null,null,null,0,"N",null,null,0,0,0,0,0]
[null,"LE7","Consultation with students and staff",null,null,"N/A","N/A","N/A",null,null,null,"N/A","N/A",null,0,null,null,null,null,0,null,null,null,0,0,0,0,0,null,null,null,null,0,0,0,0,null,null,null,null,null,null,null,null,0,0,0,0,null,null,null,null,null,null,null,null,null,null,null,null,null,null,null,null,null,null,0,"N",null,null,null,null,null,null,null,null,null,null,0,"N",null,0,null,null,0,"N",null,0,null,null,null,null,null,null,null,0,"N",null,0,null,null,null,null,null,null,null,null,null,null,null,null,null,null,null,null,null,null,null,0,"N",null,null,{"$f":"IF(EDUSchool=\"y\",1,0)","v":0},null,null,null,null,null,null,null,null,null,0,"N",null,0,null,null,null,null,null,null,null,null,null,null,null,null,null,null,0,"N",null,null,0,0,0,0,0]
[null,"LE8","Local Wildlife Partnership",null,null,"N/A","N/A","N/A",null,null,null,"N/A","N/A",null,0,null,null,null,null,0,null,null,null,0,0,0,0,0,null,null,null,null,0,0,0,0,null,null,null,null,null,null,null,null,0,0,0,0,null,null,null,null,null,null,null,null,null,null,null,null,null,null,null,null,null,null,0,"N",null,null,null,null,null,null,null,null,null,null,0,"N",null,0,null,null,0,"N",null,0,null,null,null,null,null,null,null,0,"N",null,0,null,null,null,null,null,null,null,null,null,null,null,null,null,null,null,null,null,null,null,0,"N",null,null,{"$f":"IF(EDUSchool=\"y\",1,0)","v":0},null,null,null,null,null,null,null,null,null,0,"N",null,0,null,null,null,null,null,null,null,null,null,null,null,null,null,null,0,"N",null,null,0,0,0,0,0]
[null,"The Land Use & Ecology BREEAM issues do not apply for an assessment of an existing building fit-out.",null,null,null,null,null,null,null,null,null,null,null,null,null,null,null,null,null,null,null,null,null,null,null,null,null,null,null,null,null,null,null,null,null,null,null,null,null,null,null,null,null,null,null,null,null,null,null,null,null,null,0,null,null,null,null,null,null,null,null,null,null,null,null,null,{"$f":"SUM(BA123:BN123)","v":0},"N",null,null,null,{"$f":"IF(OFFfitout=\"y\",1,0)","v":1},null,null,null,null,null,null,{"$f":"SUM(BR123:BZ123)","v":1},{"$f":"IF(CA123>=0.1,\"Y\",\"N\")","v":"Y"},null,null,null,null,0,"N",null,null,null,null,null,null,null,null,null,0,"N",null,null,null,{"$f":"IF(RETfitout=\"y\",1,0)","v":0},null,null,null,null,null,null,null,null,null,null,null,null,null,null,null,null,null,0,"N",null,0,null,null,null,null,null,null,null,null,null,null,0,"N",null,null,null,{"$f":"IF(INDfitout=\"y\",1,0)","v":0},null,null,null,null,null,null,null,null,null,null,null,null,0,"N"]
[null,"Förorening"]
[null,"Pol 1","Köldmediers klimatpåverkan - installationssystem","One credit where evidence provided demonstrates the use of refrigerants with a global warming potential (GWP) of less than 5 or where there are no refrigerants specified for use in building services.",null,"1. Byggnaden saknar köldmedier. \nELLER\n2. Köldmediers ODP = 0 och GWP < 5 i installationssystem.","1. Byggnaden saknar köldmedier. \n\nELLER\n2. Köldmediers ODP = 0 och GWP < 5 i installationssystem.",{"$f":"$D125","v":"One credit where evidence provided demonstrates the use of refrigerants with a global warming potential (GWP) of less than 5 or where there are no refrigerants specified for use in building services."},null,null,null,"1. Byggnaden saknar köldmedier. \nELLER\n2. Köldmediers ODP = 0 och GWP < 5 i installationssystem.",{"$f":"$D125","v":"One credit where evidence provided demonstrates the use of refrigerants with a global warming potential (GWP) of less than 5 or where there are no refrigerants specified for use in building services."},null,{"$f":"IF(HC=\"y\",AE125,+IF(Ret=\"y\",AG125,+IF(OFF=\"y\",AI125,+IF(TOYOTA=\"y\",AU125,+IF(PRISONS=\"y\",AM125,+IF(SCHOOLS=\"y\",AO125,+IF(FE=\"y\",AQ125,+IF(INDUSTRIAL=\"y\",AS125))))))))","v":1},null,null,null,null,{"$f":"IF(partnewpartrefurb=\"y\",(Q125*$Q$16)+(R125*$R$16),0)","v":0},null,null,null,{"$f":"IF(OR(islike($V125,\"*2*\"),islike($V125,\"*1B*\")),EY125*0.5,EY125)","v":{"$error":"#NAME?"}},{"$f":"IF(OR(islike($V125,\"*2*\"),islike($V125,\"*1B*\")),EZ125*0.5,EZ125)","v":{"$error":"#NAME?"}},{"$f":"IF(OR(islike($V125,\"*2*\"),islike($V125,\"*1B*\")),FA125*0.5,FA125)","v":{"$error":"#NAME?"}},{"$f":"IF(OR(islike($V125,\"*2*\"),islike($V125,\"*1B*\")),FB125*0.5,FB125)","v":{"$error":"#NAME?"}},{"$f":"IF(OR(islike($V125,\"*2*\"),islike($V125,\"*1B*\")),FC125*0.5,FC125)","v":{"$error":"#NAME?"}},null,null,null,null,{"$f":"IF(DP125=\"y\",AH125,0)","v":1},1,{"$f":"IF(CB125=\"y\",AJ125,0)","v":1},1,null,null,null,null,null,null,null,null,{"$f":"IF(EV125=\"y\",AT125,0)","v":1},1,{"$f":"IF(DP125=\"y\",AV125,0)","v":1},1,null,null,null,null,0,null,null,null,null,null,null,null,null,null,null,null,null,null,0,"N",null,1,null,null,null,null,null,null,null,null,{"$f":"SUM(BR125:BZ125)","v":1},"Y",null,0,null,null,0,"N",null,0,null,null,null,null,null,null,null,0,"N",null,1,null,null,null,null,null,null,null,null,null,null,null,null,null,null,null,null,null,null,null,1,"Y",null,0,null,null,null,null,null,null,null,null,null,null,0,"N",null,1,null,null,null,null,0,0,null,null,null,null,null,null,null,null,1,"Y",null,null,0,0,0,0,0]
[null,"Pol 2","Förebyggande av köldmedieläckage","One credit where evidence provided demonstrates that refrigerant leaks can be detected or where there are no refrigerants specified for the development.\n\nOne credit where evidence provided demonstrates that the provision of automatic refrigerant pump down is made to a heat exchanger (or dedicated storage tanks) with isolation valves. Or where there are no refrigerants specified for the development.",null,"1. Byggnaden saknar köldmedium \nELLER\nLäckagedetektering\n2. System som använder köldmedier förvaras i delvis lufttät inbyggnad (eller i ett mekaniskt ventilerat maskinrum) och läckagedetektering är installerat för systemets högriskdelar. \nELLER\n3. Ett automatiskt permanent system för läckagedetektering är specificerat och detta baseras INTE på principen att upptäcka eller mäta koncentrationen av köldmedier i luften.\n\nSystem för återvinning av köldmedium\n4. Automatisk nedstängning och nedpumpning av köldmediet sker när höga koncentrationer upptäcks i maskinrummet eller i inbyggnaden. I de flesta fall uppfylls detta endast av system i mekaniskt ventilerade/till viss del lufttäta maskinrum (eller inbyggnad).\n5.  Automatisk nedpumpning till antingen en separat lagringstank eller till värmeväxlaren accepteras, men endast om automatiska avstängningsventiler är monterade för att hålla kvar köldmediet efter nedpumpning.\n6. Larmgränsen för automatisk nedpumpning är inställd på maximalt 2 000 ppm (0,2 %), men lägre nivåer kan ställas in. Poäng erhålls inte för manuella system. \nObservera: För handels- och kontorsbyggnader erhålls första poängen när kravet på läckagedetektering är uppfyllt. Andra poängen erhålls när kravet för återvinning av köldmedier uppfylls. Första poängen ska ha erhållits för att andra ska kunna delas ut. \n\nObservera: För industribyggnader kan poäng erhållas om det både är specificerat system för läckagedetektering OCH system för återvinning, enligt kriterierna ovan.\n","1. Byggnaden saknar köldmedium \nELLER\n\nLäckagedetektering\n2. System som använder köldmedier förvaras i delvis lufttät inbyggnad (eller i ett mekaniskt ventilerat maskinrum) och läckagedetektering är installerat för systemets högriskdelar. \n\nELLER\n3. Ett automatiskt permanent system för läckagedetektering är specificerat och detta baseras INTE på principen att upptäcka eller mäta koncentrationen av köldmedier i luften.\n\nSystem för återvinning av köldmedium\n4. Automatisk nedstängning och nedpumpning av köldmediet sker när höga koncentrationer upptäcks i maskinrummet eller i inbyggnaden. I de flesta fall uppfylls detta endast av system i mekaniskt ventilerade/till viss del lufttäta maskinrum (eller inbyggnad).\n5.  Automatisk nedpumpning till antingen en separat lagringstank eller till värmeväxlaren accepteras, men endast om automatiska avstängningsventiler är monterade för att hålla kvar köldmediet efter nedpumpning.\n6. Larmgränsen för automatisk nedpumpning är inställd på maximalt 2 000 ppm (0,2 %), men lägre nivåer kan ställas in. Poäng erhålls inte för manuella system. \nObservera: För handels- och kontorsbyggnader erhålls första poängen när kravet på läckagedetektering är uppfyllt. Andra poängen erhålls när kravet för återvinning av köldmedier uppfylls. Första poängen ska ha erhållits för att andra ska kunna delas ut. \n\nObservera: För industribyggnader kan poäng erhållas om det både är specificerat system för läckagedetektering OCH system för återvinning, enligt kriterierna ovan.\n",{"$f":"$D126","v":"One credit where evidence provided demonstrates that refrigerant leaks can be detected or where there are no refrigerants specified for the development.\n\nOne credit where evidence provided demonstrates that the provision of automatic refrigerant pump down is made to a heat exchanger (or dedicated storage tanks) with isolation valves. Or where there are no refrigerants specified for the development."},null,null,null,"1. Byggnaden saknar köldmedium \nELLER\n\nLäckagedetektering\n2. System som använder köldmedier förvaras i delvis lufttät inbyggnad (eller i ett mekaniskt ventilerat maskinrum) och läckagedetektering är installerat för systemets högriskdelar. \n\nELLER\n3. Ett automatiskt permanent system för läckagedetektering är specificerat och detta baseras INTE på principen att upptäcka eller mäta koncentrationen av köldmedier i luften.\n\nSystem för återvinning av köldmedium\n4. Automatisk nedstängning och nedpumpning av köldmediet sker när höga koncentrationer upptäcks i maskinrummet eller i inbyggnaden. I de flesta fall uppfylls detta endast av system i mekaniskt ventilerade/till viss del lufttäta maskinrum (eller inbyggnad).\n5.  Automatisk nedpumpning till antingen en separat lagringstank eller till värmeväxlaren accepteras, men endast om automatiska avstängningsventiler är monterade för att hålla kvar köldmediet efter nedpumpning.\n6. Larmgränsen för automatisk nedpumpning är inställd på maximalt 2 000 ppm (0,2 %), men lägre nivåer kan ställas in. Poäng erhålls inte för manuella system. \nObservera: För handels- och kontorsbyggnader erhålls första poängen när kravet på läckagedetektering är uppfyllt. Andra poängen erhålls när kravet för återvinning av köldmedier uppfylls. Första po-ängen ska ha erhållits för att andra ska kunna delas ut. \n\nObservera: För industribyggnader kan poäng erhållas om det både är specificerat system för läckagedetektering OCH system för återvinning, enligt kriterierna ovan.\n",{"$f":"$D126","v":"One credit where evidence provided demonstrates that refrigerant leaks can be detected or where there are no refrigerants specified for the development.\n\nOne credit where evidence provided demonstrates that the provision of automatic refrigerant pump down is made to a heat exchanger (or dedicated storage tanks) with isolation valves. Or where there are no refrigerants specified for the development."},null,{"$f":"IF(HC=\"y\",AE126,+IF(Ret=\"y\",AG126,+IF(OFF=\"y\",AI126,+IF(TOYOTA=\"y\",AU126,+IF(PRISONS=\"y\",AM126,+IF(SCHOOLS=\"y\",AO126,+IF(FE=\"y\",AQ126,+IF(INDUSTRIAL=\"y\",AS126))))))))","v":2},null,null,null,null,{"$f":"IF(partnewpartrefurb=\"y\",(Q126*$Q$16)+(R126*$R$16),0)","v":0},null,null,null,{"$f":"IF(OR(islike($V126,\"*2*\"),islike($V126,\"*1B*\")),EY126*0.5,EY126)","v":{"$error":"#NAME?"}},{"$f":"IF(OR(islike($V126,\"*2*\"),islike($V126,\"*1B*\")),EZ126*0.5,EZ126)","v":{"$error":"#NAME?"}},{"$f":"IF(OR(islike($V126,\"*2*\"),islike($V126,\"*1B*\")),FA126*0.5,FA126)","v":{"$error":"#NAME?"}},{"$f":"IF(OR(islike($V126,\"*2*\"),islike($V126,\"*1B*\")),FB126*0.5,FB126)","v":{"$error":"#NAME?"}},{"$f":"IF(OR(islike($V126,\"*2*\"),islike($V126,\"*1B*\")),FC126*0.5,FC126)","v":{"$error":"#NAME?"}},null,null,null,null,2,2,2,2,null,null,null,null,null,null,null,null,1,1,2,2,null,null,null,null,1,null,null,null,null,null,null,null,null,null,null,null,null,null,1,"Y",null,1,null,null,null,null,null,null,null,null,{"$f":"SUM(BR126:BZ126)","v":1},{"$f":"IF(CA126>=0.1,\"Y\",\"N\")","v":"Y"},null,1,null,null,1,"Y",null,1,null,null,null,null,null,null,null,1,"Y",null,1,null,null,null,null,null,null,null,null,null,null,null,null,null,null,null,null,null,null,null,1,"Y",null,1,null,null,null,null,null,null,null,null,null,null,1,"Y",null,1,null,null,null,null,null,null,null,null,null,null,null,null,null,null,1,"Y",null,null,0,0,0,0,0]
[null,"Pol 3","Köldmediers klimatpåverkan - kylförvaring","One credit where evidence provided demonstrates the use of refrigerants within cold storage systems with a global warming potential (GWP) of less than 5.",null,"1. För alla köldmedier i kyllagersystem är den ozonnedbrytande potentialen ODP = 0, och den globala uppvärmningspotentialen GWP < 5. \n2. Kravet gäller köldmedier i system som är integrerade i byggnaden där det finns:\na. Kyllager \nb. Kyllagerinrättningar inklusive rör för kylt vatten, rör och kanaler för köldmedium etc.\nc. Stationära kalla eller kylda förvaringsskåp\nd. Stationära kylare för mat och drycker\n","1. För alla köldmedier i kyllagersystem är den ozonnedbrytande potentialen ODP = 0, och den globala uppvärmningspotentialen GWP < 5. \n2. Kravet gäller köldmedier i system som är integrerade i byggnaden där det finns:\na. Kyllager \nb. Kyllagerinrättningar inklusive rör för kylt vatten, rör och kanaler för köldmedium etc.\nc. Stationära kalla eller kylda förvaringsskåp\nd. Stationära kylare för mat och drycker\n","N/A",null,null,null,"1. För alla köldmedier i kyllagersystem är den ozonnedbrytande potentialen ODP = 0, och den globala uppvärmningspotentialen GWP < 5. \n2. Kravet gäller köldmedier i system som är integrerade i byggnaden där det finns:\na. Kyllager \nb. Kyllagerinrättningar inklusive rör för kylt vatten, rör och kanaler för köldmedium etc.\nc. Stationära kalla eller kylda förvaringsskåp\nd. Stationära kylare för mat och drycker\n","N/A",null,0,null,null,null,null,{"$f":"IF(partnewpartrefurb=\"y\",(Q127*$Q$16)+(R127*$R$16),0)","v":0},null,null,null,{"$error":"#NAME?"},{"$error":"#NAME?"},{"$error":"#NAME?"},{"$error":"#NAME?"},{"$error":"#NAME?"},null,null,null,null,0,1,0,0,null,null,null,null,null,null,null,null,0,1,0,1,null,null,null,null,null,null,null,null,null,null,null,null,null,null,null,null,null,{"$f":"IF(HCcoldstorage=\"y\",1,0)","v":0},0,"N",null,null,null,null,null,null,null,null,null,null,0,"N",null,0,null,null,0,"N",null,null,null,{"$f":"IF(PRIcold=\"y\",1,0)","v":0},null,null,null,null,null,0,"N",null,null,null,null,null,null,null,null,null,null,null,null,{"$f":"IF(TOYOTA=\"y\",0,+IF(RETcold=\"y\",1,0))","v":0},null,null,null,null,null,null,null,null,0,"N",null,null,null,null,null,null,null,null,null,{"$f":"IF(EDUcold=\"y\",1,0)","v":0},null,null,0,"N",null,null,null,null,null,null,null,null,null,null,null,null,null,{"$f":"IF(INDcold=\"y\",1,0)","v":0},null,null,0,"N",null,null,0,0,0,0,0]
[null,"Pol 4","NOx-utsläpp från värmekälla",null,null,"1. Tillverkarens uppgifter visar att den värmekälla som installeras och som tillgodoser byggnadens uppvärmningsbehov genererar högst följande torra NOx-utsläpp vid 0 % överskott av O2: \n\nKriterier för exemplarisk nivå \nNedan beskrivs kriterier för exemplarisk nivå för innovationspoäng i denna BREEAM-indikator. \n1. Poäng för exemplarisk nivå erhålls om tillverkarens uppgifter visar att installerad värmekälla som tillgodoser byggnadens uppvärmningsbehov inte orsakar något NOx-utsläpp (torr gas) vid 0 % överskott av O2.","1. Tillverkarens uppgifter visar att den värmekälla som installeras och som tillgodoser byggnadens uppvärmningsbehov genererar högst följande torra NOx-utsläpp vid 0 % överskott av O2: \n\nKriterier för exemplarisk nivå \nNedan beskrivs kriterier för exemplarisk nivå för innovationspoäng i denna BREEAM-indikator. \n1. Poäng för exemplarisk nivå erhålls om tillverkarens uppgifter visar att installerad värmekälla som tillgodoser byggnadens uppvärmningsbehov inte orsakar något NOx-utsläpp (torr gas) vid 0 % överskott av O2.","One credit where evidence provided demonstrates that the maximum dry NOx emissions from delivered space heating energy are ≤100 mg/kWh (at 0% excess O2).\n\nTwp credits where evidence provided demonstrates that the maximum dry NOx emissions from delivered space heating energy are ≤70 mg/kWh (at 0% excess O2).\n\nThree credits where evidence provided demonstrates that the maximum dry NOx emissions from delivered space heating energy are ≤40 mg/kWh (at 0% excess O2).",null,null,null,"1. Tillverkarens uppgifter visar att den värmekälla som installeras och som tillgodoser byggnadens uppvärmningsbehov genererar högst följande torra NOx-utsläpp vid 0 % överskott av O2: \n\nKriterier för exemplarisk nivå \nNedan beskrivs kriterier för exemplarisk nivå för innovationspoäng i denna BREEAM-indikator. \n1. Poäng för exemplarisk nivå erhålls om tillverkarens uppgifter visar att installerad värmekälla som tillgodoser byggnadens uppvärmningsbehov inte orsakar något NOx-utsläpp (torr gas) vid 0 % överskott av O2.","One credit where evidence provided demonstrates that the maximum dry NOx emissions from delivered space heating energy are ≤100 mg/kWh (at 0% excess O2).\n\nTwp credits where evidence provided demonstrates that the maximum dry NOx emissions from delivered space heating energy are ≤70 mg/kWh (at 0% excess O2).\n\nThree credits where evidence provided demonstrates that the maximum dry NOx emissions from delivered space heating energy are ≤40 mg/kWh (at 0% excess O2).",null,{"$f":"IF(HC=\"y\",AE128,+IF(Ret=\"y\",AG128,+IF(OFF=\"y\",AI128,+IF(TOYOTA=\"y\",AU128,+IF(PRISONS=\"y\",AM128,+IF(SCHOOLS=\"y\",AO128,+IF(FE=\"y\",AQ128,+IF(INDUSTRIAL=\"y\",AS128))))))))","v":3},null,null,null,null,{"$f":"IF(partnewpartrefurb=\"y\",(Q128*$Q$16)+(R128*$R$16),0)","v":0},null,null,null,{"$error":"#NAME?"},{"$error":"#NAME?"},{"$error":"#NAME?"},{"$error":"#NAME?"},{"$error":"#NAME?"},null,null,null,null,0,3,3,3,null,null,null,null,null,null,null,null,0,2,0,3,null,null,null,null,1,null,null,null,null,null,null,null,null,null,null,null,null,null,1,"Y",null,null,null,null,{"$f":"IF(OFFheated=\"y\",3,0)","v":3},null,null,null,null,null,3,"Y",null,1,null,null,1,"Y",null,1,null,null,null,null,null,null,null,1,"Y",null,null,null,null,null,null,null,null,{"$f":"IF(retheated=\"y\",3,0)","v":0},null,null,null,null,null,null,null,null,null,null,null,null,0,"N",null,1,null,null,null,null,null,null,null,null,null,null,1,"Y",null,null,null,null,null,null,{"$f":"IF(INDsmalloffice=\"y\",1,0)","v":0},{"$f":"IF(INDlargeoffice=\"y\",1,0)","v":0},null,null,{"$f":"IF(INDheated=\"y\",1,0)","v":0},{"$f":"IF(INDheated=\"y\",1,0)","v":0},null,null,null,null,0,{"$f":"IF(EU128>=1,\"Y\",\"N\")","v":"N"},null,null,0,0,0,0,0]
[null,"Pol 5","översvämningsrisk","Two credits where evidence provided demonstrates that the assessed development is located in a zone defined as having a low annual probability of flooding.\n\nOne credit where evidence provided demonstrates that the assessed development is located in a zone defined as having a medium or high annual probability of flooding AND the ground level of the building, car parking and access is above the design flood level for the site’s location.\n\nOne further credit where evidence provided demonstrates that surface water run-off attenuation measures are specified to minimise the risk of localised flooding, resulting from a loss of flood storage on site due to development.",null,"Två poäng\n1. Utbyggnaden sker i ett område med låg årlig sannolikhet för översvämning. Se definiton i Tolkning av bedömningskriterier.\n2. Punkt 1 är verifierad med en översvämningskarta framtagen av relevant nationell vattenmyndighet. Om översvämningskartor saknas, ska punkt 1 bekräftas i en bedömning av tomten utförd av relevant lokal myndighet. Bekräftelsen ska baseras på historiska OCH geologiska data, till exempel höjd och alla översvämningskällor ska beaktas. \n\nEtt poäng\n1. Utbyggnad sker i ett område med medelhög eller hög årlig sannolikhet för översvämning. Se defi-nition i Tolkning av bedömningskriterier. \n2. Punkt 1 är verifierad med en översvämningskarta framtagen av relevant nationell vattenmyndighet. Om översvämningskartor saknas, ska punkt 1 verifieras i en bedömning av tomten utförd av rele-vant lokal myndighet. Verifieringen ska baseras på historiska OCH geologiska data, till exempel höjd. Alla översvämningskällor ska beaktas.\n3. Projektet är tillräckligt resistent mot översvämning och dess källor. Detta är accepterat av lokala myndigheter och offentliga organ. \n4. Byggnadens marknivå, tillgång till byggnaden och till tomten är utformad (eller zonindelad) så att de ligger minst 600 mm över dimensionerande översvämningsnivå för området där byggnaden är placerad, se not 6 o 7.\n\nYtterligare poäng kan erhållas där som \n5. Dämpande åtgärder har specificerats att säkerställa: \na. Maximal avrinning från tomt till vattendrag (naturliga eller kommunala) är inte större än för samma tomt före projektet, för alla händelser med återkomstintervall på upp till 100 år. \n\nDen antagna tilläggsvolymen av regnvattenutsläpp som följd av projektet, för en 1 på 100 års hän-delse, är helt reducerad av infiltration OCH/ELLER om detta vatten kan användas i byggnaden till annat än dricksvatten, till exempel för spolning av WC. \n6. Åtgärderna ska dimensioneras utifrån dynamiska vågteorier enligt EN 752:2008 och EN 12056 – 3:2000\n7. Kapaciteten hos åtgärderna ska inkludera hänsyn till klimatförändringar\n8. Eventuella återstående regnvattenvolymer som inte kan hindras från att släppas ut, (skäl ska moti-veras och dokumenteras), ska maximal utsläppsvolym från tomten reduceras till: \na. Tomtens uppskattade årliga översvämningsvolym, Qbar före projektet ELLER\nb. Minsta vattenflöde (liter per sekund) baserat på riktlinjer för bästa praxis för att förhindra stopp på grund av för litet avlopp.","Två poäng\n1. Utbyggnaden sker i ett område med låg årlig sannolikhet för översvämning. Se definiton i Tolkning av bedömningskriterier.\n2. Punkt 1 är verifierad med en översvämningskarta framtagen av relevant nationell vattenmyndighet. Om översvämningskartor saknas, ska punkt 1 bekräftas i en bedömning av tomten utförd av relevant lokal myndighet. Bekräftelsen ska baseras på historiska OCH geologiska data, till exempel höjd och alla översvämningskällor ska beaktas. \n\nEtt poäng\n1. Utbyggnad sker i ett område med medelhög eller hög årlig sannolikhet för översvämning. Se defi-nition i Tolkning av bedömningskriterier. \n2. Punkt 1 är verifierad med en översvämningskarta framtagen av relevant nationell vattenmyndighet. Om översvämningskartor saknas, ska punkt 1 verifieras i en bedömning av tomten utförd av relevant lokal myndighet. Verifieringen ska baseras på historiska OCH geologiska data, till exempel höjd. Alla översvämningskällor ska beaktas.\n3. Projektet är tillräckligt resistent mot översvämning och dess källor. Detta är accepterat av lokala myndigheter och offentliga organ. \n4. Byggnadens marknivå, tillgång till byggnaden och till tomten är utformad (eller zonindelad) så att de ligger minst 600 mm över dimensionerande översvämningsnivå för området där byggnaden är placerad, se not 6 o 7.\n\nYtterligare poäng kan erhållas där som \n5. Dämpande åtgärder har specificerats att säkerställa: \na. Maximal avrinning från tomt till vattendrag (naturliga eller kommunala) är inte större än för samma tomt före projektet, för alla händelser med återkomstintervall på upp till 100 år. \n\nDen antagna tilläggsvolymen av regnvattenutsläpp som följd av projektet, för en 1 på 100 års hän-delse, är helt reducerad av infiltration OCH/ELLER om detta vatten kan användas i byggnaden till annat än dricksvatten, till exempel för spolning av WC. \n6. Åtgärderna ska dimensioneras utifrån dynamiska vågteorier enligt EN 752:2008 och EN 12056 – 3:2000\n7. Kapaciteten hos åtgärderna ska inkludera hänsyn till klimatförändringar\n8. Eventuella återstående regnvattenvolymer som inte kan hindras från att släppas ut, (skäl ska moti-veras och dokumenteras), ska maximal utsläppsvolym från tomten reduceras till: \na. Tomtens uppskattade årliga översvämningsvolym, Qbar före projektet ELLER\nb. Minsta vattenflöde (liter per sekund) baserat på riktlinjer för bästa praxis för att förhindra stopp på grund av för litet avlopp.",{"$f":"$D129","v":"Two credits where evidence provided demonstrates that the assessed development is located in a zone defined as having a low annual probability of flooding.\n\nOne credit where evidence provided demonstrates that the assessed development is located in a zone defined as having a medium or high annual probability of flooding AND the ground level of the building, car parking and access is above the design flood level for the site’s location.\n\nOne further credit where evidence provided demonstrates that surface water run-off attenuation measures are specified to minimise the risk of localised flooding, resulting from a loss of flood storage on site due to development."},null,null,null,"Två poäng\n1. Utbyggnaden sker i ett område med låg årlig sannolikhet för översvämning. Se definiton i Tolkning av bedömningskriterier.\n2. Punkt 1 är verifierad med en översvämningskarta framtagen av relevant nationell vattenmyndighet. Om översvämningskartor saknas, ska punkt 1 bekräftas i en bedömning av tomten utförd av relevant lokal myndighet. Bekräftelsen ska baseras på historiska OCH geologiska data, till exempel höjd och alla översvämningskällor ska beaktas. \n\nEtt poäng\n1. Utbyggnad sker i ett område med medelhög eller hög årlig sannolikhet för översvämning. Se defi-nition i Tolkning av bedömningskriterier. \n2. Punkt 1 är verifierad med en översvämningskarta framtagen av relevant nationell vattenmyndighet. Om översvämningskartor saknas, ska punkt 1 verifieras i en bedömning av tomten utförd av relevant lokal myndighet. Verifieringen ska baseras på historiska OCH geologiska data, till exempel höjd. Alla översvämningskällor ska beaktas.\n3. Projektet är tillräckligt resistent mot översvämning och dess källor. Detta är accepterat av lokala myndigheter och offentliga organ. \n4. Byggnadens marknivå, tillgång till byggnaden och till tomten är utformad (eller zonindelad) så att de ligger minst 600 mm över dimensionerande översvämningsnivå för området där byggnaden är placerad, se not 6 o 7.\n\nYtterligare poäng kan erhållas där som \n5. Dämpande åtgärder har specificerats att säkerställa: \na. Maximal avrinning från tomt till vattendrag (naturliga eller kommunala) är inte större än för samma tomt före projektet, för alla händelser med återkomstintervall på upp till 100 år. \n\nDen antagna tilläggsvolymen av regnvattenutsläpp som följd av projektet, för en 1 på 100 års hän-delse, är helt reducerad av infiltration OCH/ELLER om detta vatten kan användas i byggnaden till annat än dricksvatten, till exempel för spolning av WC. \n6. Åtgärderna ska dimensioneras utifrån dynamiska vågteorier enligt EN 752:2008 och EN 12056 – 3:2000\n7. Kapaciteten hos åtgärderna ska inkludera hänsyn till klimatförändringar\n8. Eventuella återstående regnvattenvolymer som inte kan hindras från att släppas ut, (skäl ska motiveras och dokumenteras), ska maximal utsläppsvolym från tomten reduceras till: \na. Tomtens uppskattade årliga översvämningsvolym, Qbar före projektet ELLER\nb. Minsta vattenflöde (liter per sekund) baserat på riktlinjer för bästa praxis för att förhindra stopp på grund av för litet avlopp.",{"$f":"$D129","v":"Two credits where evidence provided demonstrates that the assessed development is located in a zone defined as having a low annual probability of flooding.\n\nOne credit where evidence provided demonstrates that the assessed development is located in a zone defined as having a medium or high annual probability of flooding AND the ground level of the building, car parking and access is above the design flood level for the site’s location.\n\nOne further credit where evidence provided demonstrates that surface water run-off attenuation measures are specified to minimise the risk of localised flooding, resulting from a loss of flood storage on site due to development."},null,0,null,null,null,null,{"$f":"IF(partnewpartrefurb=\"y\",Q129,0)","v":0},null,null,null,{"$error":"#NAME?"},{"$error":"#NAME?"},{"$error":"#NAME?"},{"$error":"#NAME?"},{"$error":"#NAME?"},null,null,null,null,0,3,0,3,null,null,null,null,null,null,null,null,0,3,0,3,null,null,null,null,1,null,null,null,null,null,null,null,null,null,null,null,null,null,1,"Y",null,null,{"$f":"IF(Offnewrefurb=\"y\",1,0)","v":0},null,null,null,null,null,null,null,0,"N",null,1,null,null,1,"Y",null,1,null,null,null,null,null,null,null,1,"Y",null,null,{"$f":"IF(RETnewrefurb=\"y\",1,0)","v":0},null,null,null,null,null,null,null,null,null,null,null,null,null,null,null,null,null,null,0,"N",null,1,null,null,null,null,null,null,null,null,null,null,1,"Y",null,null,{"$f":"IF(INDnewrefurb=\"y\",1,0)","v":0},null,null,null,null,null,null,null,null,null,null,null,null,null,0,"N",null,null,0,0,0,0,0]
[null,"Pol 6","Minimera föroreningar i vattendrag","One credit where evidence provided demonstrates that effective on site treatment such as Sustainable Drainage Systems (SUDs) or oil separators have been specified in areas that are or could be a source of watercourse pollution.",null,"\n1. För avrinning från område med relativt låg föroreningsrisk används ett hållbart urbant dräneringssystem för ytvatten såsom dagvattendammar, infiltrationssystem, permeabla ytor, infiltreringsdiken eller motsvarande. \n2. Där avrinning sker från område med hög föroreningsrisk eller med utsläpp av ämnen som till exem-pel bensin och olja, ska olje- eller bensinavskiljare specificeras för ytvatten (se Tolkning av bedömningskriterier för områden). \n3. Bekräftelse från relevant offentligt organ att de planerade lösningarna godkänns.\n4. En övergripande och uppdaterad plan för ytvattenhantering tomten kommer att finnas tillgänglig för användare av byggnaden/tomten.\n\nDessutom, om byggnaden har lagerutrymme för kemikalier eller flytande gas, krävs följande:\n5. Avstängningsventiler ska finnas på tomtens dagvattensystem för att förhindra kemikalieläckage ut till naturliga vattendrag (i händelse av utsläpp eller fel vid uppsamling).","1. För avrinning från område med relativt låg föroreningsrisk används ett hållbart urbant dräneringssystem för ytvatten såsom dagvattendammar, infiltrationssystem, permeabla ytor, infiltreringsdiken eller motsvarande. \n2. Där avrinning sker från område med hög föroreningsrisk eller med utsläpp av ämnen som till exempel bensin och olja, ska olje- eller bensinavskiljare specificeras för ytvatten (se Tolkning av bedöm-ningskriterier för områden). \n3. Bekräftelse från relevant offentligt organ att de planerade lösningarna godkänns.\n4. En övergripande och uppdaterad plan för ytvattenhantering tomten kommer att finnas tillgänglig för användare av byggnaden/tomten.\n\nDessutom, om byggnaden har lagerutrymme för kemikalier eller flytande gas, krävs följande:\n5. Avstängningsventiler ska finnas på tomtens dagvattensystem för att förhindra kemikalieläckage ut till naturliga vattendrag (i händelse av utsläpp eller fel vid uppsamling).",{"$f":"$D130","v":"One credit where evidence provided demonstrates that effective on site treatment such as Sustainable Drainage Systems (SUDs) or oil separators have been specified in areas that are or could be a source of watercourse pollution."},null,null,null,"1. För avrinning från område med relativt låg föroreningsrisk används ett hållbart urbant dräneringssystem för ytvatten såsom dagvattendammar, infiltrationssystem, permeabla ytor, infiltreringsdiken eller motsvarande. \n2. Där avrinning sker från område med hög föroreningsrisk eller med utsläpp av ämnen som till exempel bensin och olja, ska olje- eller bensinavskiljare specificeras för ytvatten (se Tolkning av bedöm-ningskriterier för områden). \n3. Bekräftelse från relevant offentligt organ att de planerade lösningarna godkänns.\n4. En övergripande och uppdaterad plan för ytvattenhantering tomten kommer att finnas tillgänglig för användare av byggnaden/tomten.\n\nDessutom, om byggnaden har lagerutrymme för kemikalier eller flytande gas, krävs följande:\n5. Avstängningsventiler ska finnas på tomtens dagvattensystem för att förhindra kemikalieläckage ut till naturliga vattendrag (i händelse av utsläpp eller fel vid uppsamling).",{"$f":"$D130","v":"One credit where evidence provided demonstrates that effective on site treatment such as Sustainable Drainage Systems (SUDs) or oil separators have been specified in areas that are or could be a source of watercourse pollution."},null,1,null,null,null,null,{"$f":"IF(partnewpartrefurb=\"y\",Q130,0)","v":0},null,null,null,{"$error":"#NAME?"},{"$error":"#NAME?"},{"$error":"#NAME?"},{"$error":"#NAME?"},{"$error":"#NAME?"},null,null,null,null,1,1,1,1,null,null,null,null,null,null,null,null,1,1,1,1,null,null,null,null,1,null,null,null,null,null,null,null,null,null,null,null,null,null,1,"Y",null,1,null,null,null,null,null,null,null,null,1,"Y",null,1,null,null,1,"Y",null,1,null,null,null,null,null,null,null,1,"Y",null,1,null,null,null,null,null,null,null,null,null,null,null,null,null,null,null,null,null,null,null,1,"Y",null,1,null,null,null,null,null,null,null,null,null,null,1,"Y",null,1,null,null,null,null,null,null,null,null,null,null,null,null,null,null,1,"Y",null,null,0,0,0,0,0]
[null,"Pol 7","Begränsning av ljusförorening nattetid","One credit where evidence provided demonstrates that the external lighting design is in compliance with the guidance in the Institution of Lighting Engineers (ILE) Guidance notes for the reduction of obtrusive light, 2005. ",null,"1. Strategin för utomhusbelysning är utformad så att den ligger inom gränserna för de ljustekniska parametrar som är beskrivna i avsnitt 2.7 i CIE 150-2003 och Tabell 2 i CIE 126-1997.\n2. Ljusreklam, där det är specificerat, ska uppfylla följande:\na. För belysningsstyrkans jämnhet gäller följande:\nb. Maximal luminans (cd/m2) ska uppfylla följande, definition av zonerna finns under Ytterligare information.\n3. All belysning utomhus (utom säkerhetsbelysning, nödbelysning och ljusreklam) kan släckas automatiskt mellan kl. 23.00 och 07.00. Detta görs för all belysning utomhus med en timer som är inställd på lämpliga klockslag. Ljusreklam ska uppfylla kriterierna i punkt 2 ovan, med undantag för zon E1 där maximal luminans ska vara noll efter släckning.\n4. Om det finns säkerhets- eller nödbelysning som ska används mellan kl. 23.00 och 07.00, ska denna del av belysningssystemet uppfylla de lägre belysningsnivåerna som rekommenderas i CIE 150-2003 och CIE 126-1997 under dessa timmar. Till exempel kan en automatisk strömbrytare an-vändas som reducerar ljusnivåer kl. 23.00 eller tidigare.","1. Strategin för utomhusbelysning är utformad så att den ligger inom gränserna för de ljustekniska parametrar som är beskrivna i avsnitt 2.7 i CIE 150-2003 och Tabell 2 i CIE 126-1997.\n2. Ljusreklam, där det är specificerat, ska uppfylla följande:\na. För belysningsstyrkans jämnhet gäller följande:\nb. Maximal luminans (cd/m2) ska uppfylla följande, definition av zonerna finns under Ytterligare information.\n3. All belysning utomhus (utom säkerhetsbelysning, nödbelysning och ljusreklam) kan släckas automatiskt mellan kl. 23.00 och 07.00. Detta görs för all belysning utomhus med en timer som är inställd på lämpliga klockslag. Ljusreklam ska uppfylla kriterierna i punkt 2 ovan, med undantag för zon E1 där maximal luminans ska vara noll efter släckning.\n4. Om det finns säkerhets- eller nödbelysning som ska används mellan kl. 23.00 och 07.00, ska denna del av belysningssystemet uppfylla de lägre belysningsnivåerna som rekommenderas i CIE 150-2003 och CIE 126-1997 under dessa timmar. Till exempel kan en automatisk strömbrytare an-vändas som reducerar ljusnivåer kl. 23.00 eller tidigare.",{"$f":"$D131","v":"One credit where evidence provided demonstrates that the external lighting design is in compliance with the guidance in the Institution of Lighting Engineers (ILE) Guidance notes for the reduction of obtrusive light, 2005. "},null,null,null,"1. Strategin för utomhusbelysning är utformad så att den ligger inom gränserna för de ljustekniska parametrar som är beskrivna i avsnitt 2.7 i CIE 150-2003 och Tabell 2 i CIE 126-1997.\n2. Ljusreklam, där det är specificerat, ska uppfylla följande:\na. För belysningsstyrkans jämnhet gäller följande:\nb. Maximal luminans (cd/m2) ska uppfylla följande, definition av zonerna finns under Ytterligare information.\n3. All belysning utomhus (utom säkerhetsbelysning, nödbelysning och ljusreklam) kan släckas automatiskt mellan kl. 23.00 och 07.00. Detta görs för all belysning utomhus med en timer som är in-ställd på lämpliga klockslag. Ljusreklam ska uppfylla kriterierna i punkt 2 ovan, med undantag för zon E1 där maximal luminans ska vara noll efter släckning.\n4. Om det finns säkerhets- eller nödbelysning som ska används mellan kl. 23.00 och 07.00, ska denna del av belysningssystemet uppfylla de lägre belysningsnivåerna som rekommenderas i CIE 150-2003 och CIE 126-1997 under dessa timmar. Till exempel kan en automatisk strömbrytare an-vändas som reducerar ljusnivåer kl. 23.00 eller tidigare.","Where evidence provided demonstrates that the external lighting design is in compliance with best practice guidance from the Commission Internationale D’éclairage (CIE).",null,1,null,null,null,null,{"$f":"IF(partnewpartrefurb=\"y\",(Q131*$Q$16)+(R131*$R$16),0)","v":0},null,null,null,{"$error":"#NAME?"},{"$error":"#NAME?"},{"$error":"#NAME?"},{"$error":"#NAME?"},{"$error":"#NAME?"},null,null,null,null,1,1,1,1,null,null,null,null,null,null,null,null,1,1,1,1,null,null,null,null,1,null,null,null,null,null,null,null,null,null,null,null,null,null,{"$f":"SUM(BA131:BN131)","v":1},"Y",null,1,null,null,null,null,null,null,null,null,1,"Y",null,1,null,null,1,"Y",null,1,null,null,null,null,null,null,null,1,"Y",null,1,null,null,null,null,null,null,null,null,null,null,null,null,null,null,null,null,null,null,null,1,"Y",null,1,null,null,null,null,null,null,null,null,null,null,1,"Y",null,1,null,null,null,null,null,null,null,null,null,null,null,null,null,null,1,"Y",null,null,0,0,0,0,0]
[null,"Pol 8","Bullerdämpning","One credit where evidence provided demonstrates that new sources of noise from the development do not give rise to the likelihood of complaints from existing noise-sensitive premises and amenity or wildlife areas that are within the locality of the site.",null," 1. Det finns eller kommer att finnas, bullerkänsliga områden eller byggnader inom 800 meter från det bedömda projektet. \nPoängen erhålls automatiskt om det inte finns eller inte kommer att finnas några bullerkänsliga om-råden eller byggnader i närheten av den bedömda byggnaden. \n2. En bullerkonsekvensutredning är genomförd enligt ISO 1996 och följande bullernivåer är uppmätta eller bestämda:\na. Befintliga bakgrundsbullernivåer vid den närmaste eller den mest utsatta bullerkänsliga bygg-naden till den föreslagna byggnaden, eller på en plats där det går att argumentera för att bak-grundsförhållandena är lika.\nKlassificering av bullernivån som följer av den föreslagna bullerkällan. Detta kan baseras med hän-visning till liknande anläggningar eller tomter, eller bestämmas genom beräkning.\n\nBullerkonsekvensutredningen ska utföras av en ljudsakkunnig med godkänd akustisk kompetens (se Relevanta definitioner i avsnittet Ytterligare vägledning).\n3. Poäng erhålls om specifik bullernivå från bullerkällor på tomten/byggnaden är +5 dB dagtid (mellan kl. 07.00 och 22.00) och +3 dB nattetid (mellan kl. 22.00 och 07.00) jämfört med bakgrundsbullerni-vån.  \n4. Om klassificeringsnivån av bullerkällorna från tomten/byggnaden är högre än bakgrundsbullernivån, genomförs åtgärder för att dämpa bullret vid dess källa till en nivå som motsvarar krav 3."," 1. Det finns eller kommer att finnas, bullerkänsliga områden eller byggnader inom 800 meter från det bedömda projektet. \nPoängen erhålls automatiskt om det inte finns eller inte kommer att finnas några bullerkänsliga om-råden eller byggnader i närheten av den bedömda byggnaden. \n2. En bullerkonsekvensutredning är genomförd enligt ISO 1996 och följande bullernivåer är uppmätta eller bestämda:\na. Befintliga bakgrundsbullernivåer vid den närmaste eller den mest utsatta bullerkänsliga byggnaden till den föreslagna byggnaden, eller på en plats där det går att argumentera för att bak-grundsförhållandena är lika.\nKlassificering av bullernivån som följer av den föreslagna bullerkällan. Detta kan baseras med hänvisning till liknande anläggningar eller tomter, eller bestämmas genom beräkning.\nBullerkonsekvensutredningen ska utföras av en ljudsakkunnig med godkänd akustisk kompetens (se Relevanta definitioner i avsnittet Ytterligare vägledning).\n3. Poäng erhålls om specifik bullernivå från bullerkällor på tomten/byggnaden är +5 dB dagtid (mellan kl. 07.00 och 22.00) och +3 dB nattetid (mellan kl. 22.00 och 07.00) jämfört med bakgrundsbullerni-vån.  \n4. Om klassificeringsnivån av bullerkällorna från tomten/byggnaden är högre än bakgrundsbullernivån, genomförs åtgärder för att dämpa bullret vid dess källa till en nivå som motsvarar krav 3.",{"$f":"$D132","v":"One credit where evidence provided demonstrates that new sources of noise from the development do not give rise to the likelihood of complaints from existing noise-sensitive premises and amenity or wildlife areas that are within the locality of the site."},null,null,null," 1. Det finns eller kommer att finnas, bullerkänsliga områden eller byggnader inom 800 meter från det bedömda projektet. \nPoängen erhålls automatiskt om det inte finns eller inte kommer att finnas några bullerkänsliga om-råden eller byggnader i närheten av den bedömda byggnaden. \n2. En bullerkonsekvensutredning är genomförd enligt ISO 1996 och följande bullernivåer är uppmätta eller bestämda:\na. Befintliga bakgrundsbullernivåer vid den närmaste eller den mest utsatta bullerkänsliga byggnaden till den föreslagna byggnaden, eller på en plats där det går att argumentera för att bak-grundsförhållandena är lika.\nKlassificering av bullernivån som följer av den föreslagna bullerkällan. Detta kan baseras med hän-visning till liknande anläggningar eller tomter, eller bestämmas genom beräkning.\n\nBullerkonsekvensutredningen ska utföras av en ljudsakkunnig med godkänd akustisk kompetens (se Relevanta definitioner i avsnittet Ytterligare vägledning).\n3. Poäng erhålls om specifik bullernivå från bullerkällor på tomten/byggnaden är +5 dB dagtid (mellan kl. 07.00 och 22.00) och +3 dB nattetid (mellan kl. 22.00 och 07.00) jämfört med bakgrundsbullerni-vån.  \n4. Om klassificeringsnivån av bullerkällorna från tomten/byggnaden är högre än bakgrundsbullernivån, genomförs åtgärder för att dämpa bullret vid dess källa till en nivå som motsvarar krav 3.",{"$f":"$D132","v":"One credit where evidence provided demonstrates that new sources of noise from the development do not give rise to the likelihood of complaints from existing noise-sensitive premises and amenity or wildlife areas that are within the locality of the site."},null,1,null,null,null,null,{"$f":"IF(partnewpartrefurb=\"y\",Q132,0)","v":0},null,null,null,{"$error":"#NAME?"},{"$error":"#NAME?"},{"$error":"#NAME?"},{"$error":"#NAME?"},{"$error":"#NAME?"},null,null,null,null,1,1,1,1,null,null,null,null,null,null,null,null,1,1,1,1,null,null,null,null,1,null,null,null,null,null,null,null,null,null,null,null,null,null,1,"Y",null,1,null,null,null,null,null,null,null,null,1,"Y",null,1,null,null,1,"Y",null,1,null,null,null,null,null,null,null,1,"Y",null,1,null,null,null,null,null,null,null,null,null,null,null,null,null,null,null,null,null,null,null,1,"Y",null,1,null,null,null,null,null,null,null,null,null,null,1,"Y",null,1,null,null,null,null,null,null,null,null,null,null,null,null,null,null,1,"Y",null,null,0,0,0,0,0]
[null,"Innovation"]
[null,"Man 3","Byggarbetsplatsens påverkan","Evidence provided demonstrates that all of the items a-g listed previously are achieved and at least\n80% of site timber is responsibly sourced and 100% is legally sourced.",{"$f":"$D134","v":"Evidence provided demonstrates that all of the items a-g listed previously are achieved and at least\n80% of site timber is responsibly sourced and 100% is legally sourced."},"Ett poäng om minst 100 % av trävirket till byggarbetsplatsen är inköpt på ett ansvarsfullt sätt och 100 % är lagligt avverkat.","Ett poäng om minst 100 % av trävirket till byggarbetsplatsen är inköpt på ett ansvarsfullt sätt och 100 % är lagligt avverkat.","Evidence provided demonstrates that all of the items a-g listed previously are achieved and at least\n80% of site timber is responsibly sourced and 100% is legally sourced.",null,null,null,"Ett poäng om minst 100 % av trävirket till byggarbetsplatsen är inköpt på ett ansvarsfullt sätt och 100 % är lagligt avverkat.",{"$f":"$D134","v":"Evidence provided demonstrates that all of the items a-g listed previously are achieved and at least\n80% of site timber is responsibly sourced and 100% is legally sourced."},null,{"$f":"IF(HC=\"y\",AE134,+IF(Ret=\"y\",AG134,+IF(OFF=\"y\",AI134,+IF(COURTS=\"y\",AK134,+IF(PRISONS=\"y\",AM134,+IF(SCHOOLS=\"y\",AO134,+IF(FE=\"y\",AQ134,+IF(INDUSTRIAL=\"y\",AS134))))))))","v":1},null,null,null,null,{"$f":"IF(partnewpartrefurb=\"y\",Q134,0)","v":0},null,null,null,null,null,null,null,null,null,null,null,null,{"$f":"IF(DP134=\"y\",AH134,0)","v":1},1,{"$f":"IF(CB134=\"y\",AJ134,0)","v":1},1,null,null,null,null,null,null,null,null,{"$f":"IF(EV134=\"y\",AT134,0)","v":1},1,0,null,null,null,null,null,1,null,null,null,null,null,null,null,null,null,null,null,null,null,1,"Y",null,1,null,null,null,null,null,null,null,null,1,"Y",null,1,null,null,1,"Y",null,1,null,null,null,null,null,null,null,1,"Y",null,1,null,null,null,null,null,null,null,null,null,null,null,null,null,null,null,null,null,null,null,1,"Y",null,1,null,null,null,null,null,null,null,null,null,null,{"$f":"SUM(DR134:EB134)","v":1},"Y",null,1,null,null,null,null,null,null,null,null,null,null,null,null,null,null,1,"Y"]
[null,"Hea 1","Dagsljus","One additional innovation credit where evidence provided demonstrates that at least 80% of the office floor area has achieved increased daylight levels. In addition, in retail developments, at least 50% by floor area of the common spaces and 35% by floor area of the sales spaces are adequately daylit. ","One additional innovation credit where evidence provided demonstrates that at least 80% of the office floor area has achieved increased daylight levels. In addition, in retail developments, at least 50% by floor area of the common spaces and 35% by floor area of the sales spaces are adequately daylit. ","1. Minst 80 % av golvytan (i utrymme/rum enligt kriterierna) har en genomsnittlig dagsljusfaktor enligt  Tabell 7, eller en genomsnittlig belysningsstyrka (dagsljus) på 300 lux under 2 650 timmar per år i flervåningsbyggnad, eller 400 lux i envåningsbyggnad.\n\n2. Kriterier för jämnhet, utblick mot himmel eller rumsdjup är uppfyllda. Om kraven på jämnhet eller på dagsljusfaktor används gäller:\na. Jämnheten ska vara minst 0,4 (i utrymmen med glastak, till exempel i atrium minst 0,7) eller så ska dagsljusfaktor i en punkt klara kraven i Tabell 8:\n\n3. I handelsbyggnader ska minst 50 % av golvarean i gemensamma utrymmen och 35 % av golvarean i försäljningsutrymme ha dagsljusfaktor i en punkt enligt Tabell 9 eller så är belysningsstyrkan (dagsljuset) i en punkt minst 200 lux under 2 650 timmar per år.","1. Minst 80 % av golvytan (i utrymme/rum enligt kriterierna) har en genomsnittlig dagsljusfaktor enligt  Tabell 7, eller en genomsnittlig belysningsstyrka (dagsljus) på 300 lux under 2 650 timmar per år i flervåningsbyggnad, eller 400 lux i envåningsbyggnad.\n\n2. Kriterier för jämnhet, utblick mot himmel eller rumsdjup är uppfyllda. Om kraven på jämnhet eller på dagsljusfaktor används gäller:\na. Jämnheten ska vara minst 0,4 (i utrymmen med glastak, till exempel i atrium minst 0,7) eller så ska dagsljusfaktor i en punkt klara kraven i Tabell 8:\n\n3. I handelsbyggnader ska minst 50 % av golvarean i gemensamma utrymmen och 35 % av golvarean i försäljningsutrymme ha dagsljusfaktor i en punkt enligt Tabell 9 eller så är belysningsstyrkan (dagsljuset) i en punkt minst 200 lux under 2 650 timmar per år.","One additional innovation credit where evidence provided demonstrates that at least 80% of the office floor area has achieved increased daylight levels. In addition, in retail developments, at least 50% by floor area of the common spaces and 35% by floor area of the sales spaces are adequately daylit. ",null,null,null,"1. Minst 80 % av golvytan (i utrymme/rum enligt kriterierna) har en genomsnittlig dagsljusfaktor enligt  Tabell 7, eller en genomsnittlig belysningsstyrka (dagsljus) på 300 lux under 2 650 timmar per år i flervåningsbyggnad, eller 400 lux i envåningsbyggnad.\n\n2. Kriterier för jämnhet, utblick mot himmel eller rumsdjup är uppfyllda. Om kraven på jämnhet eller på dagsljusfaktor används gäller:\na. Jämnheten ska vara minst 0,4 (i utrymmen med glastak, till exempel i atrium minst 0,7) eller så ska dagsljusfaktor i en punkt klara kraven i Tabell 8:\n\n3. I handelsbyggnader ska minst 50 % av golvarean i gemensamma utrymmen och 35 % av golvarean i försäljningsutrymme ha dagsljusfaktor i en punkt enligt Tabell 9 eller så är belysningsstyrkan (dagsljuset) i en punkt minst 200 lux under 2 650 timmar per år.",{"$f":"$D135","v":"One additional innovation credit where evidence provided demonstrates that at least 80% of the office floor area has achieved increased daylight levels. In addition, in retail developments, at least 50% by floor area of the common spaces and 35% by floor area of the sales spaces are adequately daylit. "},null,1,null,null,null,null,{"$f":"IF(partnewpartrefurb=\"y\",(Q135*$Q$16)+(R135*$R$16),0)","v":0},null,null,null,null,null,null,null,null,null,null,null,null,1,1,1,1,null,null,null,null,null,null,null,null,1,1,0,null,null,null,null,null,1,null,null,null,null,null,null,null,null,null,null,null,null,null,1,{"$f":"IF(BO135>=0.1,\"Y\",\"N\")","v":"Y"},null,1,null,null,null,null,null,null,null,null,1,"Y",null,1,null,null,1,"Y",null,1,null,null,null,null,null,null,null,1,"Y",null,1,null,null,null,null,null,null,null,null,null,null,null,null,null,null,null,null,null,null,null,1,"Y",null,1,null,null,null,null,null,null,null,null,null,null,1,"Y",null,1,null,null,null,null,null,null,null,null,null,null,null,null,null,null,1,"Y"]
[null,"Hea 9 ","Flyktiga organiska föreningar, VOC","One additional innovation credit where evidence provided demonstrates that all internal finishes and fittings specified in the building have been tested against and meet the relevant standards for Volatile Organic Compound (VOC) emissions.",null,"1. Poängen för Hea 9 ska ha erhållits\n\n2. Alla produktkategorier (där de är specificerade) har testats och uppfyller relevanta standar-der för halter av flyktiga organiska föreningar (VOC). ","1. Poängen för Hea 9 ska ha erhållits\n\n2. Alla produktkategorier (där de är specificerade) har testats och uppfyller relevanta standarder för halter av flyktiga organiska föreningar (VOC). ",null,null,null,null,"1. Poängen för Hea 9 ska ha erhållits\n\n2. Alla produktkategorier (där de är specificerade) har testats och uppfyller relevanta standarder för halter av flyktiga organiska föreningar (VOC). ",{"$f":"$D$136","v":"One additional innovation credit where evidence provided demonstrates that all internal finishes and fittings specified in the building have been tested against and meet the relevant standards for Volatile Organic Compound (VOC) emissions."},null,1,null,null,null,null,{"$f":"IF(partnewpartrefurb=\"y\",(Q136*$Q$16)+(R136*$R$16),0)","v":0},null,null,null,null,null,null,null,null,null,null,null,null,1,1,1,1,null,null,null,null,null,null,null,null,1,1,0,null,null,null,null,null,null,null,null,null,null,null,null,null,null,null,null,null,null,null,null,null,null,1,null,null,null,null,null,null,null,null,1,"Y",null,null,null,null,null,null,null,null,null,null,null,null,null,null,null,null,null,null,1,null,null,null,null,null,null,null,null,null,null,null,null,null,null,null,null,null,null,null,1,"Y",null,null,null,null,null,null,null,null,null,null,null,null,null,null,null,1,null,null,null,null,null,null,null,null,null,null,null,null,null,null,1,"Y"]
[null,"Hea 14","Mindre kontorsutrymme i handel och industri","One additional innovation credit where evidence provided demonstrates that all the measures have been achieved for at least 80% of the development’s office space floor area","N/A","En innovationspoäng kan erhållas när alla punkter som beskrivs under Hea 14 ovan har uppnåtts för minst 80 % av byggnadens kontorsarea.","En innovationspoäng kan erhållas när alla punkter som beskrivs under Hea 14 ovan har uppnåtts för minst 80 % av byggnadens kontorsarea.",{"$f":"$E137","v":"N/A"},null,null,null,"En innovationspoäng kan erhållas när alla punkter som beskrivs under Hea 14 ovan har uppnåtts för minst 80 % av byggnadens kontorsarea.","An exemplary credit can be awarded where all the measures detailed above have been achieved for at least 80% of the development’s office space floor area.",null,0,null,null,null,null,{"$f":"IF(partnewpartrefurb=\"y\",(Q137*$Q$16)+(R137*$R$16),0)","v":0},null,null,null,null,null,null,null,null,null,null,null,null,0,1,0,0,null,null,null,null,null,null,null,null,0,1,0,null,null,null,null,null,0,null,null,null,null,null,null,null,null,null,null,null,null,null,{"$f":"SUM(BA137:BN137)","v":0},"N",null,0,null,null,null,null,null,null,null,null,0,"N",null,0,null,null,0,"N",null,0,null,null,null,null,null,null,null,0,"N",null,null,null,null,null,null,null,null,null,null,null,null,null,null,null,null,{"$f":"IF(RETofficesmall=\"y\",1,0)","v":0},null,null,null,null,0,"N",null,0,null,null,null,null,null,null,null,null,null,null,0,"N",null,null,null,null,null,null,{"$f":"IF(INDsmalloffice=\"y\",1,0)","v":0},null,null,null,null,null,null,null,null,null,0,"N"]
[null,"Ene 1","Energianvändning","One additional innovation credit where an energy modelling carried out using a Dynamic Simulation Modelling software demonstrates the building is designed to be a carbon neutral building (i.e. in terms of building services energy demand).\n\nTwo additional innovation credits where energy modelling carried out using a Dynamic Simulation Modelling software demonstrates the building is designed to be a True zero carbon building (in terms of building services and operational energy demand).\n",{"$f":"$D138","v":"One additional innovation credit where an energy modelling carried out using a Dynamic Simulation Modelling software demonstrates the building is designed to be a carbon neutral building (i.e. in terms of building services energy demand).\n\nTwo additional innovation credits where energy modelling carried out using a Dynamic Simulation Modelling software demonstrates the building is designed to be a True zero carbon building (in terms of building services and operational energy demand).\n"},"Innovationspoäng under Ene 1 har utgått i BREEAM SE","Innovationspoäng under Ene 1 har utgått i BREEAM SE",{"$f":"$D138","v":"One additional innovation credit where an energy modelling carried out using a Dynamic Simulation Modelling software demonstrates the building is designed to be a carbon neutral building (i.e. in terms of building services energy demand).\n\nTwo additional innovation credits where energy modelling carried out using a Dynamic Simulation Modelling software demonstrates the building is designed to be a True zero carbon building (in terms of building services and operational energy demand).\n"},null,null,null,"Innovationspoäng under Ene 1 har utgått i BREEAM SE",{"$f":"$D138","v":"One additional innovation credit where an energy modelling carried out using a Dynamic Simulation Modelling software demonstrates the building is designed to be a carbon neutral building (i.e. in terms of building services energy demand).\n\nTwo additional innovation credits where energy modelling carried out using a Dynamic Simulation Modelling software demonstrates the building is designed to be a True zero carbon building (in terms of building services and operational energy demand).\n"},null,0,null,null,null,null,{"$f":"IF(partnewpartrefurb=\"y\",Q138,0)","v":0},null,null,null,null,null,null,null,null,null,null,null,null,0,0,0,0,null,null,null,null,null,null,null,null,0,0,0,null,null,null,null,null,1,null,null,null,null,null,null,null,null,null,null,null,null,null,1,"Y",null,0,null,null,null,null,null,null,null,null,0,"N",null,1,null,null,1,"Y",null,1,null,null,null,null,null,null,null,1,"Y",null,0,null,null,null,null,null,null,null,null,null,null,null,null,null,null,null,null,null,null,null,0,"N",null,1,null,null,null,null,null,null,null,null,null,null,1,"Y",null,0,null,null,null,null,null,null,null,null,null,null,null,null,null,null,0,"N"]
[null,"Ene 5","Energiförsörjning med låga koldioxidutsläpp","One additional innovation credit where evidence provided demonstrates that a local LZC energy technology has been installed in line with the recommendations of the above feasibility study and this method of supply results in a 20% reduction in the building’s CO2 emissions.","One additional innovation credit where evidence provided demonstrates that a local LZC energy technology has been installed in line with the recommendations of the above feasibility study and this method of supply results in a 20% reduction in the building’s CO2 emissions.","Nedan beskrivs kriterierna för de tre innovationspoäng som finns tillgängliga i denna BREEAMindikator. \n\nEn innovationspoäng\n1. Första poängen är uppnådd.\n2. Lokal LZCteknik installeras som följer rekommendationerna i förstudien och minskar byggnadens årliga CO2utsläpp med 50 %. Beräkning av procentuell minskning beskrivs i Tolkning av bedömningskriterier nedan.\n3. Siffror som används vid beräkning av procentuell reduktion av koldioxidutsläpp på grund av LZCteknik, baseras på resultat från erkänt energiberäkningsprogram.\n\nTvå innovationspoäng\n1. Första poängen är uppnådd.\n2. Lokal LZCteknik installeras som följer rekommendationerna i förstudien och minskar byggnadens årliga CO2utsläpp med 100 %. Beräkning av procentuell reduktion beskrivs i Tolkning av bedömningskriterier nedan.\n3. Siffror som används vid beräkning av procentuell minskning av koldioxidutsläpp på grund av LZCteknik, baseras på resultat från erkänt energiberäkningsprogram.\n\nTre innovationspoäng\n1. Installation av LZCteknik, som minskar CO2utsläppen med 100 % vad avser all energi till byggnaden, det vill säga som resulterar i en byggnad utan koldioxidutsläpp. Med all energi avses energi till både fastighet och verksamhet. \n2. Siffror som används vid beräkning av procentuell reduktion av koldioxidutsläpp på grund av LZCteknik, baseras på resultat från erkänt energiberäkningsprogram.\n\nByggnader som uppfyller kriterierna för exemplarisk nivå kan således erhålla sex poäng i denna indikator.\n","Nedan beskrivs kriterierna för de tre innovationspoäng som finns tillgängliga i denna BREEAM-indikator. \n\nEn innovationspoäng\n1. Första poängen är uppnådd.\n2. Lokal LZC-teknik installeras som följer rekommendationerna i förstudien och minskar byggnadens årliga CO2-utsläpp med 50 %. Beräkning av procentuell minskning beskrivs i Tolkning av bedöm-ningskriterier nedan.\n3. Siffror som används vid beräkning av procentuell reduktion av koldioxidutsläpp på grund av LZC-teknik, baseras på resultat från erkänt energiberäkningsprogram.\n\nTvå innovationspoäng\n1. Första poängen är uppnådd.\n2. Lokal LZC-teknik installeras som följer rekommendationerna i förstudien och minskar byggnadens årliga CO2-utsläpp med 100 %. Beräkning av procentuell reduktion beskrivs i Tolkning av bedöm-ningskriterier nedan.\n3. Siffror som används vid beräkning av procentuell minskning av koldioxidutsläpp på grund av LZC-teknik, baseras på resultat från erkänt energiberäkningsprogram.\n\nTre innovationspoäng\n1. Installation av LZC-teknik, som minskar CO2-utsläppen med 100 % vad avser all energi till bygg-naden, det vill säga som resulterar i en byggnad utan koldioxidutsläpp. Med all energi avses energi till både fastighet och verksamhet. \n2. Siffror som används vid beräkning av procentuell reduktion av koldioxidutsläpp på grund av LZC-teknik, baseras på resultat från erkänt energiberäkningsprogram.\n\nByggnader som uppfyller kriterierna för exemplarisk nivå kan således erhålla sex poäng i denna indika-tor.\n","One additional innovation credit where evidence provided demonstrates that a local LZC energy technology has been installed in line with the recommendations of the above feasibility study and this method of supply results in a 20% reduction in the building’s CO2 emissions.",null,null,null,"En innovationspoäng\n1. Första poängen är uppnådd.\n2. Lokal LZC-teknik installeras som följer rekommendationerna i förstudien och minskar byggnadens årliga CO2-utsläpp med 50 %. Beräkning av procentuell minskning beskrivs i Tolkning av bedömningskriterier nedan.\n3. Siffror som används vid beräkning av procentuell reduktion av koldioxidutsläpp på grund av LZC-teknik, baseras på resultat från erkänt energiberäkningsprogram.\n\nTvå innovationspoäng\n1. Första poängen är uppnådd.\n2. Lokal LZC-teknik installeras som följer rekommendationerna i förstudien och minskar byggnadens årliga CO2-utsläpp med 100 %. Beräkning av procentuell reduktion beskrivs i Tolkning av bedömningskriterier nedan.\n3. Siffror som används vid beräkning av procentuell minskning av koldioxidutsläpp på grund av LZC-teknik, baseras på resultat från erkänt energiberäkningsprogram.\n\nTre innovationspoäng\n1. Installation av LZC-teknik, som minskar CO2-utsläppen med 100 % vad avser all energi till bygg-naden, det vill säga som resulterar i en byggnad utan koldioxidutsläpp. Med all energi avses energi till både fastighet och verksamhet. \n2. Siffror som används vid beräkning av procentuell reduktion av koldioxidutsläpp på grund av LZC-teknik, baseras på resultat från erkänt energiberäkningsprogram.\n\nByggnader som uppfyller kriterierna för exemplarisk nivå kan således erhålla sex poäng i denna indikator.","One additional innovation credit where evidence provided demonstrates that a local LZC energy technology has been installed in line with the recommendations of the above feasibility study and this method of supply results in a 20% reduction in the building’s CO2 emissions.",null,{"$f":"IF(HC=\"y\",AE139,+IF(Ret=\"y\",AG139,+IF(OFF=\"y\",AI139,+IF(COURTS=\"y\",AK139,+IF(PRISONS=\"y\",AM139,+IF(SCHOOLS=\"y\",AO139,+IF(FE=\"y\",AQ139,+IF(INDUSTRIAL=\"y\",AS139))))))))","v":3},null,null,null,null,0,null,null,null,null,null,null,null,null,null,null,null,null,3,3,3,3,null,null,null,null,null,null,null,null,3,3,0,null,null,null,null,null,1,null,null,null,null,null,null,null,null,null,null,null,null,null,1,"Y",null,1,null,null,null,null,null,null,null,null,1,"Y",null,1,null,null,1,"Y",null,1,null,null,null,null,null,null,null,1,"Y",null,1,null,null,null,null,null,null,null,null,null,null,null,null,null,null,null,null,null,null,null,1,"Y",null,1,null,null,null,null,null,null,null,null,null,null,1,"Y",null,1,null,null,null,null,null,null,null,null,null,null,null,null,null,null,1,"Y"]
[null,"Tra 3","Alternativa transportsätt","One additional innovation credit where evidence provided demonstrates that two of the options above have been implemented.\n",{"$f":"$D$140","v":"One additional innovation credit where evidence provided demonstrates that two of the options above have been implemented.\n"},"Ett BREEAM-poäng kan delas ut enligt följande för exemplarisk nivå :\n\nTvå av alternativen i Tra 3 ovan har implementerats.","Ett BREEAM-poäng kan delas ut enligt följande för exemplarisk nivå :\n\nTvå av alternativen i Tra 3 ovan har implementerats.",{"$f":"$D$140","v":"One additional innovation credit where evidence provided demonstrates that two of the options above have been implemented.\n"},"One additional innovation credit where evidence provided demonstrates that two of the options above have been implemented.\n","One additional innovation credit where evidence provided demonstrates that two of the options above have been implemented.\n","One additional innovation credit where evidence provided demonstrates that two of the options above have been implemented.\n","Ett BREEAM-poäng kan delas ut enligt följande för exemplarisk nivå :\n\nTvå av alternativen i Tra 3 ovan har implementerats.","One additional innovation credit where evidence provided demonstrates that two of the options above have been implemented.\n",null,1,null,null,null,null,0,null,null,null,null,null,null,null,null,null,null,null,null,1,1,1,1,null,null,null,null,null,null,null,null,1,1,0,null,null,null,null,null,null,null,null,null,null,null,null,null,null,null,null,null,null,null,0,"N",null,1,null,null,null,null,null,null,null,null,1,"Y",null,null,null,null,null,null,null,null,null,null,null,null,null,null,null,null,null,null,1,null,null,null,null,null,null,null,null,null,null,null,null,null,null,null,null,null,null,null,1,"Y",null,null,null,null,null,null,null,null,null,null,null,null,null,null,null,1,null,null,null,null,null,null,null,null,null,null,null,null,null,null,1,"Y"]
[null,"Wat 2","Vattenmätare","One additional innovation credit where evidence provided demonstrates that sub meters with a pulsed output are fitted to allow the metering of individual water-consuming plant or building areas","One additional innovation credit where evidence provided demonstrates that sub meters with a pulsed output are fitted to allow the metering of individual water-consuming plant or building areas","Ett BREEAM-poäng kan delas ut enligt följande för exemplarisk nivå :\n\n1. Det finns separata vattenmätare som tillåter mätning av enskilda vattenförbrukare eller delar i byggnaden, där vattenbehovet är lika med eller större än 10 % av byggnadens totala vattenför-brukning (se även Tolkning av bedömningskriterier)\n2. Varje vattenmätare har pulsutgång som möjliggör anslutning till  byggnadens styr- och övervak-ningssystem för kontroll av vattenförbrukningen. ","Ett poäng kan delas ut enligt följande för exemplarisk nivå :\n1. Det finns separata vattenmätare som tillåter mätning av enskilda vattenförbrukare eller delar i byggnaden, där vattenbehovet är lika med eller större än 10 % av byggnadens totala vattenförbrukning (se även Tolkning av bedömningskriterier)\n2. Varje vattenmätare har pulsutgång som möjliggör anslutning till  byggnadens styr- och övervakningssystem för kontroll av vattenförbrukningen. ","One additional innovation credit where evidence provided demonstrates that sub meters with a pulsed output are fitted to allow the metering of individual water-consuming plant or building areas",null,null,null,"Ett BREEAM-poäng kan delas ut enligt följande för exemplarisk nivå :\n\n1. Det finns separata vattenmätare som tillåter mätning av enskilda vattenförbrukare eller delar i byggnaden, där vattenbehovet är lika med eller större än 10 % av byggnadens totala vattenförbrukning (se även Tolkning av bedömningskriterier)\n2. Varje vattenmätare har pulsutgång som möjliggör anslutning till  byggnadens styr- och övervakningssystem för kontroll av vattenförbrukningen. ","One additional innovation credit where evidence provided demonstrates that sub meters with a pulsed output are fitted to allow the metering of individual water-consuming plant or building areas",null,1,null,null,null,null,0,null,null,null,null,null,null,null,null,null,null,null,null,1,1,1,1,null,null,null,null,null,null,null,null,{"$f":"IF(EV141=\"y\",AT141,0)","v":1},1,0,null,null,null,null,null,1,null,null,null,null,null,null,null,null,null,null,null,null,null,1,"Y",null,1,null,null,null,null,null,null,null,null,1,"Y",null,1,null,null,1,"Y",null,1,null,null,null,null,null,null,null,1,"Y",null,1,null,null,null,null,null,null,null,null,null,null,null,null,null,null,null,null,null,null,null,1,"Y",null,1,null,null,null,null,null,null,null,null,null,null,1,"Y",null,1,null,null,null,null,null,null,null,null,null,null,null,null,null,null,1,"Y"]
[null,"Mat 1","Materialval utifrån livscykelperspektiv","One additional innovation credit where evidence provided demonstrates that a nationally recognised LCA tool or the Green Guide to Specification has been used to evaluate a range of material options for all the building elements.","One additional innovation credit where evidence provided demonstrates that a nationally recognised LCA tool or the Green Guide to Specification has been used to evaluate a range of material options for all the building elements.","Ett BREEAM-poäng kan delas ut enligt följande för exemplarisk nivå :\n\nALTERNATIV 1 – Green Guide \na. Om fyra eller fler byggnadselement bedöms, erhåller byggnaden minst två byggnadselements-poäng utöver det totala antal som krävs för att få maximalt antal BREEAM-poäng enligt kriteri-erna. Om färre än fyra byggelement bedöms, erhåller byggnaden minst ett byggnadselements-poäng utöver det totala antalet som krävs för att få maximalt antal BREEAM-poäng enligt krite-rier.\n\nALTERNATIV 2 – Andra verktyg för materialbedömning \na. Projekteringsgruppen använder ett accepterat nationellt LCA-verktyg med funktioner som ovan, för bedömning av material i byggnaden OCH det kan visas att resultatet har påverkat val av ut-formning av alla byggnadselement. \n","Ett BREEAM-poäng kan delas ut enligt följande för exemplarisk nivå :\n\nALTERNATIV 1 – Green Guide \na. Om fyra eller fler byggnadselement bedöms, erhåller byggnaden minst två byggnadselements-poäng utöver det totala antal som krävs för att få maximalt antal BREEAM-poäng enligt kriterierna. Om färre än fyra byggelement bedöms, erhåller byggnaden minst ett byggnadselementspoäng utöver det totala antalet som krävs för att få maximalt antal BREEAM-poäng enligt kriterier.\n\nALTERNATIV 2 – Andra verktyg för materialbedömning \na. Projekteringsgruppen använder ett accepterat nationellt LCA-verktyg med funktioner som ovan, för bedömning av material i byggnaden OCH det kan visas att resultatet har påverkat val av utformning av alla byggnadselement. ","One additional innovation credit where evidence provided demonstrates that a nationally recognised LCA tool or the Green Guide to Specification has been used to evaluate a range of material options for all the building elements.",null,null,null,"Ett BREEAM-poäng kan delas ut enligt följande för exemplarisk nivå :\n\nALTERNATIV 1 – Green Guide \na. Om fyra eller fler byggnadselement bedöms, erhåller byggnaden minst två byggnadselements-poäng utöver det totala antal som krävs för att få maximalt antal BREEAM-poäng enligt kriterierna. Om färre än fyra byggelement bedöms, erhåller byggnaden minst ett byggnadselementspoäng utöver det totala antalet som krävs för att få maximalt antal BREEAM-poäng enligt kriterier.\n\nALTERNATIV 2 – Andra verktyg för materialbedömning \na. Projekteringsgruppen använder ett accepterat nationellt LCA-verktyg med funktioner som ovan, för bedömning av material i byggnaden OCH det kan visas att resultatet har påverkat val av ut-formning av alla byggnadselement. \n","One additional innovation credit where evidence provided demonstrates that a nationally recognised LCA tool or the Green Guide to Specification has been used to evaluate a range of material options for all the building elements.",null,1,null,null,null,null,0,null,null,null,null,null,null,null,null,null,null,null,null,1,1,1,1,null,null,null,null,null,null,null,null,{"$f":"IF(EV142=\"y\",AT142,0)","v":1},1,0,null,null,null,null,null,1,null,null,null,null,null,null,null,null,null,null,null,null,null,1,"Y",null,1,null,null,null,null,null,null,null,null,1,"Y",null,1,null,null,1,"Y",null,1,null,null,null,null,null,null,null,1,"Y",null,1,null,null,null,null,null,null,null,null,null,null,null,null,null,null,null,null,null,null,null,1,"Y",null,1,null,null,null,null,null,null,null,null,null,null,1,"Y",null,1,null,null,null,null,null,null,null,null,null,null,null,null,null,null,{"$f":"SUM(EF142:ET142)","v":1},"Y"]
[null,"Mat 5","Materialval utifrån ansvarsfull tillverkning och utvinning","Where, in addition to the standard BREEAM requirements, 95% of the applicable materials, comprised within the applicable building elements, have been responsibly sourced.","Where, in addition to the standard BREEAM requirements, 95% of the applicable materials, comprised within the applicable building elements, have been responsibly sourced.","1. En extra poäng kan erhållas om, förutom ovan nämnda kriterier i Mat 5, 95 % av de material som ingår i relevanta byggnadselement, har köpts in på ett ansvarsfullt sätt.","1. En extra poäng kan erhållas om, förutom ovan nämnda kriterier i Mat 5, 95 % av de material som ingår i relevanta byggnadselement, har köpts in på ett ansvarsfullt sätt.","Where, in addition to the standard BREEAM requirements, 95% of the applicable materials, comprised within the applicable building elements, have been responsibly sourced.",null,null,null,"1. En extra poäng kan erhållas om, förutom ovan nämnda kriterier i Mat 5, 95 % av de material som ingår i relevanta byggnadselement, har köpts in på ett ansvarsfullt sätt.","Where, in addition to the standard BREEAM requirements, 95% of the applicable materials, comprised within the applicable building elements, have been responsibly sourced.",null,1,null,null,null,null,0,null,null,null,null,null,null,null,null,null,null,null,null,1,1,1,1,null,null,null,null,null,null,null,null,{"$f":"IF(EV143=\"y\",AT143,0)","v":1},1,0,null,null,null,null,null,1,null,null,null,null,null,null,null,null,null,null,null,null,null,1,"Y",null,1,null,null,null,null,null,null,null,null,1,"Y",null,1,null,null,1,"Y",null,1,null,null,null,null,null,null,null,1,"Y",null,1,null,null,null,null,null,null,null,null,null,null,null,null,null,null,null,null,null,null,null,1,"Y",null,1,null,null,null,null,null,null,null,null,null,null,1,"Y",null,1,null,null,null,null,null,null,null,null,null,null,null,null,null,null,{"$f":"SUM(EF143:ET143)","v":1},"Y"]
[null,"Wst 1","Avfallshantering på byggarbetsplatsen","One additional innovation credit where evidence provided demonstrates that at least five key waste groups, or the minimum required by local regulations plus three, whichever is the most onerous, have waste reduction potential and are identified for diversion from landfill at pre-construction stage SWMP.","One additional innovation credit where evidence provided demonstrates that at least five key waste groups, or the minimum required by local regulations plus three, whichever is the most onerous, have waste reduction potential and are identified for diversion from landfill at pre-construction stage SWMP.","1. Alla tre första poängen har uppnåtts. \n2. Alla viktiga avfallskategorier som styrs bort från deponi är identifierade i planen för avfallshantering. \n3. Minst fem av de viktiga avfallskategorierna har reduceringspotential vid projekteringsskedet (check-lista A15b). Dessa ska följas upp under hela byggskedet som en del av implementeringen av pla-nen för avfallshantering. Uppnådda resultat ska redovisas i planen för avfallshantering vid färdig-ställande.\n4. Minst basnivåerna för avfallsfraktioner har identifierade att styras bort från deponi: (Avfallsfraktioner vid rivning - basnivå) enligt Kretsloppsrådets riktlinjer för avfallshantering vid byggande och rivning, \n\nByggnader som uppfyller kriterierna för exemplarisk nivå erhåller fyra poäng i denna indikator.\n","1. Alla tre första poängen har uppnåtts. \n2. Alla viktiga avfallskategorier som styrs bort från deponi är identifierade i planen för avfallshantering. \n3. Minst fem av de viktiga avfallskategorierna har reduceringspotential vid projekteringsskedet (check-lista A15b). Dessa ska följas upp under hela byggskedet som en del av implementeringen av planen för avfallshantering. Uppnådda resultat ska redovisas i planen för avfallshantering vid färdig-ställande.\n4. Minst basnivåerna för avfallsfraktioner har identifierade att styras bort från deponi: (Avfallsfraktioner vid rivning - basnivå) enligt Kretsloppsrådets riktlinjer för avfallshantering vid byggande och rivning, \n\nByggnader som uppfyller kriterierna för exemplarisk nivå erhåller fyra poäng i denna indikator.","One additional innovation credit where evidence provided demonstrates that at least five key waste groups, or the minimum required by local regulations plus three, whichever is the most onerous, have waste reduction potential and are identified for diversion from landfill at pre-construction stage SWMP.",null,null,null,"1. Alla tre första poängen har uppnåtts. \n2. Alla viktiga avfallskategorier som styrs bort från deponi är identifierade i planen för avfallshantering. \n3. Minst fem av de viktiga avfallskategorierna har reduceringspotential vid projekteringsskedet (check-lista A15b). Dessa ska följas upp under hela byggskedet som en del av implementeringen av pla-nen för avfallshantering. Uppnådda resultat ska redovisas i planen för avfallshantering vid färdigställande.\n4. Minst basnivåerna för avfallsfraktioner har identifierade att styras bort från deponi: (Avfallsfraktioner vid rivning - basnivå) enligt Kretsloppsrådets riktlinjer för avfallshantering vid byggande och rivning, \n\nByggnader som uppfyller kriterierna för exemplarisk nivå erhåller fyra poäng i denna indikator.\n","One additional innovation credit where evidence provided demonstrates that at least five key waste groups, or the minimum required by local regulations plus three, whichever is the most onerous, have waste reduction potential and are identified for diversion from landfill at pre-construction stage SWMP.",null,1,null,null,null,null,0,null,null,null,null,null,null,null,null,null,null,null,null,1,1,1,1,null,null,null,null,null,null,null,null,{"$f":"IF(EV144=\"y\",AT144,0)","v":1},1,0,null,null,null,null,null,1,null,null,null,null,null,null,null,null,null,null,null,null,null,{"$f":"SUM(BA144:BN144)","v":1},"Y",null,1,{"$f":"IF(Offnewrefurb=\"y\",1,0)","v":0},null,null,null,null,null,null,null,1,"Y",null,1,null,null,1,"Y",null,1,null,null,null,null,null,null,null,1,"Y",null,1,null,null,null,null,null,null,null,null,null,null,null,null,null,null,null,null,null,null,null,1,"Y",null,1,null,null,null,null,null,null,null,null,null,null,{"$f":"SUM(DR144:EB144)","v":1},"Y",null,1,null,null,null,null,null,null,null,null,null,null,null,null,null,null,{"$f":"SUM(EF144:ET144)","v":1},"Y"]
[null,"Pol 4","Nox-utsläpp från värmekälla","Poäng för exemplarisk nivå erhålls om tillverkarens uppgifter visar att installerad värmekälla som tillgodoser byggnadens uppvärmningsbehov inte orsakar något Nox-utsläpp (torr gas) vid 0% överskott av O2.",{"$f":"$D$145","v":"Poäng för exemplarisk nivå erhålls om tillverkarens uppgifter visar att installerad värmekälla som tillgodoser byggnadens uppvärmningsbehov inte orsakar något Nox-utsläpp (torr gas) vid 0% överskott av O2."},{"$f":"$D$145","v":"Poäng för exemplarisk nivå erhålls om tillverkarens uppgifter visar att installerad värmekälla som tillgodoser byggnadens uppvärmningsbehov inte orsakar något Nox-utsläpp (torr gas) vid 0% överskott av O2."},{"$f":"$D$145","v":"Poäng för exemplarisk nivå erhålls om tillverkarens uppgifter visar att installerad värmekälla som tillgodoser byggnadens uppvärmningsbehov inte orsakar något Nox-utsläpp (torr gas) vid 0% överskott av O2."},"Poäng för exemplarisk nivå erhålls om tillverkarens uppgifter visar att installerad värmekälla som tillgodoser byggnadens uppvärmningsbehov inte orsakar något Nox-utsläpp (torr gas) vid 0% överskott av O2.","Poäng för exemplarisk nivå erhålls om tillverkarens uppgifter visar att installerad värmekälla som tillgodoser byggnadens uppvärmningsbehov inte orsakar något Nox-utsläpp (torr gas) vid 0% överskott av O2.","Poäng för exemplarisk nivå erhålls om tillverkarens uppgifter visar att installerad värmekälla som tillgodoser byggnadens uppvärmningsbehov inte orsakar något Nox-utsläpp (torr gas) vid 0% överskott av O2.","Poäng för exemplarisk nivå erhålls om tillverkarens uppgifter visar att installerad värmekälla som tillgodoser byggnadens uppvärmningsbehov inte orsakar något Nox-utsläpp (torr gas) vid 0% överskott av O2.","Poäng för exemplarisk nivå erhålls om tillverkarens uppgifter visar att installerad värmekälla som tillgodoser byggnadens uppvärmningsbehov inte orsakar något Nox-utsläpp (torr gas) vid 0% överskott av O2.","Poäng för exemplarisk nivå erhålls om tillverkarens uppgifter visar att installerad värmekälla som tillgodoser byggnadens uppvärmningsbehov inte orsakar något Nox-utsläpp (torr gas) vid 0% överskott av O2.",null,1,null,null,null,null,0,null,null,null,null,null,null,null,null,null,null,null,null,0,1,1,1,null,null,null,null,null,null,null,null,{"$f":"IF(EV145=\"y\",AT145,0)","v":0},{"$f":"IF(AND(INDheated=\"y\",INDoperational=\"y\",OR(INDsmalloffice=\"y\",INDlargeoffice=\"y\")),1,IF(AND(INDheated=\"y\",NOT(INDoperational=\"y\"),OR(INDsmalloffice=\"y\",INDlargeoffice=\"y\")),1,IF(AND(INDheated=\"y\",INDoperational=\"y\",NOT(OR(INDsmalloffice=\"y\",INDlargeoffice=\"y\"))),1,IF(AND(NOT(INDheated=\"y\"),NOT(INDoperational=\"y\"),NOT(OR(INDsmalloffice=\"y\",INDlargeoffice=\"y\"))),0,IF(AND(NOT(INDheated=\"y\"),NOT(INDoperational=\"y\"),OR(INDsmalloffice=\"y\",INDlargeoffice=\"y\")),0,0)))))","v":0},0,null,null,null,null,null,null,null,null,null,null,null,null,null,null,null,null,null,null,null,{"$f":"SUM(BA145:BN145)","v":0},{"$f":"IF(BO145>=0.1,\"Y\",\"N\")","v":"N"},null,null,null,null,{"$f":"IF(OFFheated=\"y\",1,0)","v":1},null,null,null,null,null,1,"Y",null,null,null,null,null,null,null,null,null,null,null,null,null,null,null,null,null,null,null,null,null,null,null,null,null,{"$f":"IF(retheated=\"y\",1,0)","v":0},null,null,null,null,null,null,null,null,null,null,null,null,0,"N",null,null,null,null,null,null,null,null,null,null,null,null,null,null,null,null,null,null,null,null,{"$f":"IF(INDsmalloffice=\"y\",1,0)","v":0},{"$f":"IF(INDlargeoffice=\"y\",1,0)","v":0},null,null,null,{"$f":"IF(INDoperational=\"y\",1,0)","v":0},null,null,null,null,{"$f":"SUM(EF145:ET145)","v":0},{"$f":"IF(EU145>=2,\"Y\",\"N\")","v":"N"}]

{"sheet":"Final Score and Rating","index":3,"n_rows":50,"n_cols":36,"rows_kept":50,"cut":false,"hidden":false,"merged":[[21,21,21,23],[19,28,19,29],[19,2,19,7],[15,2,15,7],[14,2,14,7],[5,3,5,4],[9,3,9,4],[8,3,8,4],[7,3,7,4],[6,3,6,4],[11,2,11,3],[11,4,11,5],[12,2,13,3],[12,4,13,5],[13,6,13,7],[11,6,11,7],[12,6,12,7]]}
[]
[]
[]
[]
[]
[null,null,"BREEAM-SE ",{"$f":"scheme","v":0},null,"H","Pass",{"$f":"L25","v":0.3}]
[null,null,"Byggnadsnamn",{"$f":"building","v":0},null,"HH","Good",{"$f":"L26","v":0.45}]
[null,null,"BREEAM-SE ID-nummer",{"$f":"refno","v":0},null,"HHH","Very Good",{"$f":"L27","v":0.55000000000000004}]
[null,null,"BREEAM-SE Assessor:",{"$f":"assessor","v":0},null,"HHHH","Excellent",{"$f":"L28","v":0.7}]
[null,null,"BREEAM-SE assessors organisation",{"$f":"assessorg","v":0},null,"HHHHH","Outstanding",{"$f":"L29","v":0.85}]
[]
[null,null,"Certifieringssteg",null,"BREEAM-SE poäng",null,"BREEAM-SE Betyg"]
[null,null,{"$f":"'Assessment details'!D6","v":0},null,{"$f":"performance","v":0},null,{"$f":"IF(ISERROR(VLOOKUP(G14,AH24:AJ29,3)),\"\",VLOOKUP(G14,AH24:AJ29,3))","v":"HHHHH"}]
[null,null,null,null,null,null,{"$f":"finalrate","v":"UNCLASSIFIED"}]
[null,null,{"$f":"IF(finalscore>=0.8499,\"* Please note: there are requirements additional to achieving a score of 85% or more for an Outstanding Rating (refer to the scoring section of the assessment manual)\",\"\")","v":""}]
[null,null,"Minikrav i BREEAM-SE ",null,null,null,null,null,null,null,null,null,null,null,null,null,null,null,null,null,null,null,null,null,null,null,null,null,null,null,null,null,null,"N/A to Europe"]
[null,null,"Betygsnivå","Pass","Good","Very Good","Excellent","Outstanding",null,null,null,null,null,null,null,null,null,null,null,null,null,null,null,null,null,null,null,null,null,null,null,null,null,"N/A to Europe"]
[null,null,"Minikrav uppfyllda",{"$f":"IF(OR(minstand>0),\"YES\",\"NO\")","v":"NO"},{"$f":"IF(OR(minstand>1),\"YES\",\"NO\")","v":"NO"},{"$f":"IF(OR(minstand>2),\"YES\",\"NO\")","v":"NO"},{"$f":"IF(OR(minstand>3),\"YES\",\"NO\")","v":"NO"},{"$f":"IF(OR(minstand>4),\"YES\",\"NO\")","v":"NO"},null,null,null,null,null,null,null,null,null,null,null,null,null,null,null,null,null,null,null,null,null,null,null,null,null,"N/A to Europe"]
[]
[null,null,"Byggnadens BREEAM-SE-prestanda per område",null,null,null,null,null,null,null,null,null,null,null,null,null,null,null,null,null,null,null,null,"Shell & Core type:",{"$f":"shell","v":0},null,null,null,"Max allowable rating",null,"Actual rating achieved","Actual rating level achieved","Min. standard rating check"]
[null,null,null,"Viktning","Tillgängliga poäng","Erhållna poäng","% erhållna","Viktat betyg",null,null,null,null,null,null,null,"Rating level",1,2,3,4,5,null,null,null,null,null,null,null,{"$f":"IF(AND(partnewpartrefurb=\"y\",shellmin=\"y\"),MIN(Y23:Y36),IF(partnewpartrefurb=\"y\",MIN(X23:X36),IF(projtype=\"Existing Building Fit-Out\",MIN(AB23:AB36),IF(AND(projtype=\"New Build\",shellmin=\"y\"),MIN(AA23:AA36),IF(AND(projtype=\"Major Refurbishment\",shellmin=\"y\"),MIN(AA23:AA36),MIN(Z22:Z36))))))","v":0},{"$f":"VLOOKUP(minstand,K24:M29,3,TRUE)","v":"UNCLASSIFIED"},{"$f":"VLOOKUP(performance,L24:M29,2,TRUE)","v":"UNCLASSIFIED"},{"$f":"VLOOKUP(AE21,M24:N29,2,FALSE)","v":0},{"$f":"IF(minstand<actualratelevel,minrate,rateactual)","v":"UNCLASSIFIED"}]
[null,null,"Ledning",{"$f":"IF(projtype=\"Existing Building Fit-Out\",'Final Score and Rating'!N36,'Final Score and Rating'!M36)","v":0.13},{"$f":"SUM('BREEAM Credits'!O18:O33)","v":14},{"$f":"IF(partnewpartrefurb=\"y\",SUM('BREEAM Credits'!T18:T33),(SUM('BREEAM Credits'!U18:U33)))","v":0},{"$f":"F22/E22","v":0},{"$f":"G22*D22","v":0},null,null,null,null,null,null,null,"Credits Available","Pass","Good","Very Good","Exc.","Outs","Part new-build Part Refurb",null,null,"Shell & Core Part new-build Part Refurb","New build","Shell & Core New Build","Fit Out"]
[null,null,"Hälsa och inomhusmiljö",{"$f":"IF(projtype=\"Existing Building Fit-Out\",'Final Score and Rating'!N37,'Final Score and Rating'!M37)","v":0.17},{"$f":"SUM('BREEAM Credits'!O35:O53)","v":17},{"$f":"IF(partnewpartrefurb=\"y\",SUM('BREEAM Credits'!T35:T53),(SUM('BREEAM Credits'!U35:U53)))","v":0},{"$f":"F23/E23","v":0},{"$f":"G23*D23","v":0},null,null,null,null,null,null,"Man 1 Commissioning",{"$f":"'BREEAM Credits'!O18","v":2},null,null,null,1,2,null,null,{"$f":"IF('BREEAM Credits'!T18=1,4,+IF('BREEAM Credits'!T18=2,5,3))","v":3},{"$f":"IF(OR('BREEAM Credits'!V18=\"Option 2 - Green Building Guide\",'BREEAM Credits'!V18=\"Option 1b - Green lease for less than 75% of the net lettable floor area\"),IF('BREEAM Credits'!T18=0.5,4,IF('BREEAM Credits'!T18>=1,5,3)),X23)","v":3},{"$f":"IF(_man1=1,4,+IF(_man1=2,5,3))","v":3},{"$f":"IF(OR('BREEAM Credits'!V18=\"Option 2 - Green Building Guide\",'BREEAM Credits'!V18=\"Option 1b - Green lease for less than 75% of the net lettable floor area\"),IF(_man1=0.5,4,+IF(_man1>=1,5,3)),Z23)","v":3},{"$f":"IF(_man1=1,4,+IF(_man1=2,5,3))","v":3},null,null,{"$f":"IF(OR('BREEAM Credits'!Q18=0,'BREEAM Credits'!R18=0),\"N\",\"Y\")","v":"N"}]
[null,null,"Energi",{"$f":"IF(projtype=\"Existing Building Fit-Out\",'Final Score and Rating'!N38,'Final Score and Rating'!M38)","v":0.21},{"$f":"SUM('BREEAM Credits'!O56:O75)","v":25},{"$f":"IF(partnewpartrefurb=\"y\",SUM('BREEAM Credits'!T56:T75),(SUM('BREEAM Credits'!U56:U75)))","v":0},0,0,null,null,0,0,"UNCLASSIFIED",0,"Man 3 Construction site impacts",{"$f":"'BREEAM Credits'!O19","v":2},"-","-","-",1,2,null,null,{"$f":"IF('BREEAM Credits'!T20=0,3,+IF('BREEAM Credits'!T20=1,4,+IF('BREEAM Credits'!T20>=2,5)))","v":3},{"$f":"X24","v":3},{"$f":"IF('BREEAM Credits'!U20=0,3,+IF('BREEAM Credits'!U20=1,4,+IF(_man3>=2,5)))","v":3},{"$f":"Z24","v":3},{"$f":"IF('BREEAM Credits'!U21=0,3,+IF('BREEAM Credits'!U21=1,4,+IF('BREEAM Credits'!U21>=2,5)))","v":3},null,null,{"$f":"IF(OR('BREEAM Credits'!Q19=0,'BREEAM Credits'!R19=0),\"N\",\"Y\")","v":"N"},null,null,"UNCLASSIFIED",0,{"$f":"\"\"","v":""}]
[null,null,"Transport",{"$f":"IF(projtype=\"Existing Building Fit-Out\",'Final Score and Rating'!N39,'Final Score and Rating'!M39)","v":0.09},{"$f":"SUM('BREEAM Credits'!O77:O85)","v":9},{"$f":"IF(partnewpartrefurb=\"y\",SUM('BREEAM Credits'!T77:T85),(SUM('BREEAM Credits'!U77:U85)))","v":0},0,0,null,null,1,0.3,"PASS",1,"Man 4 Building User Guide",{"$f":"'BREEAM Credits'!O22","v":2},"-",1,1,1,1,null,null,{"$f":"IF('BREEAM Credits'!T22=0,1,+IF('BREEAM Credits'!T22=1,5))","v":1},{"$f":"IF(OR('BREEAM Credits'!V22=\"Option 2 - Green Building Guide\",'BREEAM Credits'!V22=\"Option 1b - Green lease for less than 75% of the net lettable floor area\"),IF('BREEAM Credits'!T22=0,1,IF('BREEAM Credits'!T22>=0.5,5,1)),X25)","v":1},{"$f":"IF(_man4=0,1,+IF(_man4>=1,5))","v":1},{"$f":"IF(OR('BREEAM Credits'!V22=\"Option 2 - Green Building Guide\",'BREEAM Credits'!V22=\"Option 1b - Green lease for less than 75% of the net lettable floor area\"),IF(_man4=0,1,+IF(_man4>=0.5,5)),Z24)","v":3},{"$f":"IF(_man4=0,1,+IF(_man4>=1,5))","v":1},null,null,{"$f":"IF(OR('BREEAM Credits'!Q20=0,'BREEAM Credits'!R20=0,'BREEAM Credits'!Q21=0,'BREEAM Credits'!R21=0),\"N\",\"Y\")","v":"N"},null,null,"PASS",0.3,"H"]
[null,null,"Vatten",{"$f":"IF(projtype=\"Existing Building Fit-Out\",'Final Score and Rating'!N40,'Final Score and Rating'!M40)","v":7.0000000000000007E-2},{"$f":"SUM('BREEAM Credits'!O87:O94)","v":9},{"$f":"IF(partnewpartrefurb=\"y\",SUM('BREEAM Credits'!T87:T94),(SUM('BREEAM Credits'!U87:U94)))","v":0},0,0,null,null,2,0.45,"GOOD",2,"Man 9 Publication of Building Information",{"$f":"'BREEAM Credits'!O27","v":0},"-","-","-","-",1,null,null,5,5,5,5,5,null,null,{"$f":"IF(OR('BREEAM Credits'!Q27=0,'BREEAM Credits'!R27=0),\"N\",\"Y\")","v":"N"},null,null,"GOOD",0.45,"HH"]
[null,null,"Material",{"$f":"IF(projtype=\"Existing Building Fit-Out\",'Final Score and Rating'!N41,'Final Score and Rating'!M41)","v":0.14000000000000001},{"$f":"SUM('BREEAM Credits'!O96:O105)","v":8},{"$f":"IF(partnewpartrefurb=\"y\",SUM('BREEAM Credits'!T96:T105),(SUM('BREEAM Credits'!U96:U105)))","v":0},0,0,null,null,3,0.55000000000000004,"VERY  GOOD",3,"Man 10 Development as a Learning Resource",{"$f":"'BREEAM Credits'!O28","v":0},"-","-","-","-",1,null,null,5,5,5,5,5,null,null,{"$f":"IF(OR('BREEAM Credits'!Q28=0,'BREEAM Credits'!R28=0),\"N\",\"Y\")","v":"N"},null,null,"VERY GOOD",0.55000000000000004,"HHH"]
[null,null,"Avfall",{"$f":"IF(projtype=\"Existing Building Fit-Out\",'Final Score and Rating'!N42,'Final Score and Rating'!M42)","v":0.08},{"$f":"SUM('BREEAM Credits'!O107:O113)","v":5},{"$f":"IF(partnewpartrefurb=\"y\",SUM('BREEAM Credits'!T107:T113),(SUM('BREEAM Credits'!U107:U113)))","v":0},0,0,null,null,4,0.7,"EXCELLENT",4,"Hea 4 High Frequency Lighting",{"$f":"'BREEAM Credits'!O38","v":1},1,1,1,1,1,null,null,{"$f":"IF(AND('BREEAM Credits'!Q38=1,'BREEAM Credits'!R38=1),5,0)","v":0},{"$f":"IF(OR('BREEAM Credits'!V38=\"Option 2 - Green Building Guide\",'BREEAM Credits'!V16=\"Option 1b - Green lease for less than 75% of the net lettable floor area\"),IF(AND('BREEAM Credits'!Q38>=0.5,'BREEAM Credits'!R38>=0.5),5,0),X28)","v":0},{"$f":"IF(_hea4=0,0,5)","v":0},{"$f":"IF(OR('BREEAM Credits'!V38=\"Option 2 - Green Building Guide\",'BREEAM Credits'!V38=\"Option 1b - Green lease for less than 75% of the net lettable floor area\"),IF(_hea4=0,0,+IF(_hea4>=0.5,5)),Z28)","v":0},{"$f":"IF(_hea4=0,0,5)","v":0},null,null,{"$f":"IF(OR('BREEAM Credits'!Q38=0,'BREEAM Credits'!R38=0),\"N\",\"Y\")","v":"N"},null,null,"EXCELLENT",0.7,"HHHH"]
[null,null,"Markanvändning och ekologi",{"$f":"IF(projtype=\"Existing Building Fit-Out\",'Final Score and Rating'!N43,'Final Score and Rating'!M43)","v":0},{"$f":"SUM('BREEAM Credits'!O115:O123)","v":0},{"$f":"IF(partnewpartrefurb=\"y\",SUM('BREEAM Credits'!T115:T123),(SUM('BREEAM Credits'!U115:U123)))","v":0},{"$f":"IF(ISERROR(IF(D29=0,0,F29/E29)),0,IF(D29=0,0,F29/E29))","v":0},0,null,null,5,0.85,"OUTSTANDING*",5,"Hea12 Microbial Contamination",{"$f":"'BREEAM Credits'!O46","v":1},1,1,1,1,1,null,null,5,5,5,5,5,null,null,{"$f":"IF(OR('BREEAM Credits'!Q46=0,'BREEAM Credits'!R46=0),\"N\",\"Y\")","v":"N"},null,null,"OUTSTANDING*",0.85,"HHHHH"]
[null,null,"Föroreningar",{"$f":"IF(projtype=\"Existing Building Fit-Out\",'Final Score and Rating'!N44,'Final Score and Rating'!M44)","v":0.11},{"$f":"SUM('BREEAM Credits'!O125:O132)","v":9},{"$f":"IF(partnewpartrefurb=\"y\",SUM('BREEAM Credits'!T125:T132),(SUM('BREEAM Credits'!U125:U132)))","v":0},0,{"$f":"D30*G30","v":0},null,null,null,null,null,null,"Ene 1 Reduction of CO2 emissions",{"$f":"'BREEAM Credits'!O56","v":13},"-","-","-",5,9,{"$f":"IF(AND('BREEAM Credits'!Q56<=5,'BREEAM Credits'!R56>=10),3,+IF(AND('BREEAM Credits'!R56<=5,'BREEAM Credits'!Q56>=10),3))","v":false},{"$f":"IF(AND(AND('BREEAM Credits'!Q56>=10,'BREEAM Credits'!Q56<=15),(AND('BREEAM Credits'!R56>=10,'BREEAM Credits'!R56<=15))),5,+IF(AND(AND('BREEAM Credits'!Q56>=6,'BREEAM Credits'!Q56<=9),(AND('BREEAM Credits'!R56>=6,'BREEAM Credits'!R56<=9))),4,+IF(AND(AND('BREEAM Credits'!Q56>=0,'BREEAM Credits'!Q56<=5),(AND('BREEAM Credits'!R56>=0,'BREEAM Credits'!R56<=5))),3,+IF(AND('BREEAM Credits'!Q56<=5,'BREEAM Credits'!R56<=9),3,+IF(AND('BREEAM Credits'!Q56<=9,'BREEAM Credits'!R56<=5),3,+IF(AND('BREEAM Credits'!Q56<=9,'BREEAM Credits'!R56<=15),4,+IF(AND('BREEAM Credits'!Q56<=15,'BREEAM Credits'!R56<=9),4)))))))","v":3},{"$f":"IF(AND('BREEAM Credits'!T56<=15,'BREEAM Credits'!T56>=10),5,+IF(AND('BREEAM Credits'!T56<=9,'BREEAM Credits'!T56>=6),4,+IF(AND('BREEAM Credits'!T56<=5,'BREEAM Credits'!T56>=1),3,3)))","v":3},{"$f":"X30","v":3},{"$f":"IF(AND(_ene1<=13,_ene1>=9),5,+IF(AND(_ene1<=9,_ene1>=5),4,+IF(AND(_ene1<=4,_ene1>=1),3,3)))","v":3},{"$f":"Z30","v":3},{"$f":"IF(AND(_ene1<=15,_ene1>=10),5,+IF(AND(_ene1<=9,_ene1>=6),4,+IF(AND(_ene1<=5,_ene1>=1),3,3)))","v":3},null,null,{"$f":"IF(OR('BREEAM Credits'!Q56=0,'BREEAM Credits'!R56=0),\"N\",\"Y\")","v":"N"},null,null,null,null,{"$f":"VLOOKUP(performance,AI24:AJ29,2,TRUE)","v":""}]
[null,null,"Innovation",0.1,10,{"$f":"IF(partnewpartrefurb=\"y\",SUM('BREEAM Credits'!T134:T145),(SUM('BREEAM Credits'!U134:U145)))","v":0},{"$f":"IF(F31>10,1,F31/E31)","v":0},{"$f":"D31*G31","v":0},null,null,null,null,null,null,"Wat 1 Water Consumption",3,"-","-",1,1,2,null,null,{"$f":"IF(AND('BREEAM Credits'!Q87=2,'BREEAM Credits'!R87=2),5,IF(AND('BREEAM Credits'!Q87=1,'BREEAM Credits'!R87=1),4,2))","v":2},{"$f":"IF(OR('BREEAM Credits'!V87=\"Option 2 - Green Building Guide\",'BREEAM Credits'!V87=\"Option 1b - Green lease for less than 75% of the net lettable floor area\"),IF(AND('BREEAM Credits'!Q87>=1,'BREEAM Credits'!R87>=1),5,IF(AND('BREEAM Credits'!Q87>=0.5,'BREEAM Credits'!R87>=0.5),4,2)),X31)","v":2},{"$f":"IF(_wat1>=2,5,IF(_wat1=1,4,2))","v":2},{"$f":"IF(OR('BREEAM Credits'!V87=\"Option 2 - Green Building Guide\",'BREEAM Credits'!V87=\"Option 1b - Green lease for less than 75% of the net lettable floor area\"),IF(_wat1=0,2,+IF(_wat1>=0.5,4,IF(_wat1=1,5))),Z31)","v":2},{"$f":"IF(_wat1=2,5,IF(_wat1=1,4,2))","v":2},null,null,{"$f":"IF(OR('BREEAM Credits'!Q87=0,'BREEAM Credits'!R87=0),\"N\",\"Y\")","v":"N"}]
[null,null,null,null,null,null,"Total",{"$f":"SUM(H22:H30)","v":0},null,null,null,null,null,null,"Ene 2 Sub Metering of Substantial Energy Use",{"$f":"'BREEAM Credits'!O57","v":1},"-","-",1,1,1,null,null,{"$f":"IF(AND('BREEAM Credits'!Q57>=1,'BREEAM Credits'!R57>=1),5,2)","v":2},{"$f":"IF(OR('BREEAM Credits'!V57=\"Option 2 - Green Building Guide\",'BREEAM Credits'!V57=\"Option 1b - Green lease for less than 75% of the net lettable floor area\"),IF(AND('BREEAM Credits'!Q57>=0.5,'BREEAM Credits'!R57>=0.5),5,2),X32)","v":2},{"$f":"IF(_ene2=0,2,+IF(_ene2>=1,5))","v":2},{"$f":"IF(OR('BREEAM Credits'!V57=\"option 2 - Green Building Guide\",'BREEAM Credits'!V57=\"Option 1b - Green lease for less than 75% of the net lettable floor area\"),IF(_ene2=0,2,+IF(_ene2>=0.5,5)),Z32)","v":2},{"$f":"IF(_ene2=0,2,+IF(_ene2<3,5))","v":2},null,null,{"$f":"IF(OR('BREEAM Credits'!Q57=0,'BREEAM Credits'!R57=0),\"N\",\"Y\")","v":"N"},null,null,"N/A to Europe"]
[null,null,null,null,null,null,"Poäng för exemplarisk nivå",{"$f":"IF(partnewpartrefurb=\"y\",(SUM('BREEAM Credits'!T134:T145)/100),(SUM('BREEAM Credits'!U134:U145)/100))","v":0},null,null,null,null,null,null,"Ene 5 Low and Zero Carbon Technologies",{"$f":"'BREEAM Credits'!O60","v":3},"-","-","-",1,1,null,null,{"$f":"IF('BREEAM Credits'!T60=0,3,+IF('BREEAM Credits'!T60>=1,5))","v":3},{"$f":"X33","v":3},{"$f":"IF(_ene5=0,3,+IF(_ene5>=1,5))","v":3},{"$f":"Z33","v":3},{"$f":"IF(_ene5=0,3,+IF(_ene5<4,5))","v":3},null,null,{"$f":"IF(OR('BREEAM Credits'!Q60=0,'BREEAM Credits'!R60=0),\"N\",\"Y\")","v":"N"},null,null,"N/A to Europe"]
[null,null,null,null,null,null,"Totalt antal innovationspoäng",{"$f":"IF(H33>=0.1,0.1,H33)","v":0},null,null,null,null,"Weightings",null,"Wat 2 Water Meter",{"$f":"'BREEAM Credits'!O88","v":1},"-",null,null,1,1,null,null,{"$f":"IF(AND('BREEAM Credits'!Q88=1,'BREEAM Credits'!R88=1),5,3)","v":3},{"$f":"IF(OR('BREEAM Credits'!V88=\"Option 2 - Green Building Guide\",'BREEAM Credits'!V88=\"Option 1b - Green lease for less than 75% of the net lettable floor area\"),IF(AND('BREEAM Credits'!Q88>=0.5,'BREEAM Credits'!R88>=0.5),5,3),X34)","v":3},{"$f":"IF(_wat2=0,3,5)","v":3},{"$f":"IF(OR('BREEAM Credits'!V88=\"Option 2 - Green Building Guide\",'BREEAM Credits'!V88=\"Option 1b - Green lease for less than 75% of the net lettable floor area\"),IF(_wat2=0,3,+IF(_wat2>=0.5,5)),Z34)","v":3},{"$f":"IF(_wat2=0,3,5)","v":3},null,null,{"$f":"IF(OR('BREEAM Credits'!Q88=0,'BREEAM Credits'!R88=0),\"N\",\"Y\")","v":"N"},null,null,"N/A to Europe"]
[null,null,null,null,null,null,"Total BREEAM-SE poäng",{"$f":"IF(ISERROR(overalltot+H34),0,overalltot+H34)","v":0},null,null,null,null,"New build/refurb","Fit out","Wst 3 Storage of Recyclable Waste",{"$f":"'BREEAM Credits'!O110","v":1},"-","-","-",1,1,null,null,{"$f":"IF('BREEAM Credits'!T110=0,3,+IF('BREEAM Credits'!T110>=1,5))","v":3},{"$f":"X35","v":3},{"$f":"IF(_wst3=0,3,+IF(_wst3>=1,5))","v":3},{"$f":"Z35","v":3},{"$f":"IF(_wst3=0,3,+IF(_wst3>=1,5))","v":3},null,null,{"$f":"IF(OR('BREEAM Credits'!Q110=0,'BREEAM Credits'!R110=0),\"N\",\"Y\")","v":"N"}]
[null,null,null,null,null,null,null,null,null,null,null,null,0.12,0.13,"LE4 Mitigating Ecological Impact",{"$f":"'BREEAM Credits'!O118","v":0},"-","-",null,2,2,null,null,{"$f":"IF('BREEAM Credits'!T118=0,3,+IF('BREEAM Credits'!T118>=2,5))","v":3},{"$f":"X36","v":3},{"$f":"IF(_le4=0,3,+IF(_le4>=2,5))","v":3},{"$f":"Z36","v":3},5,null,null,{"$f":"IF(OR('BREEAM Credits'!Q118=0,'BREEAM Credits'!R118=0),\"N\",\"Y\")","v":"N"}]
[null,null,null,null,null,null,null,null,null,null,null,null,0.15,0.17]
[null,null,null,null,null,null,null,null,null,null,null,null,0.19,0.21]
[null,null,null,null,null,null,null,null,null,null,null,null,0.08,0.09]
[null,null,null,null,null,null,null,null,null,null,null,null,0.06,7.0000000000000007E-2]
[null,null,null,null,null,null,"Ledning",{"$f":"D22","v":0.13},{"$f":"overall1","v":0},null,null,null,0.125,0.14000000000000001]
[null,null,null,null,null,null,"Hälsa och inomhusmiljö",0.17,{"$f":"overall2","v":0},null,null,null,7.4999999999999997E-2,0.08]
[null,null,null,null,null,null,"Energi",0.21,{"$f":"overall3","v":0},null,null,null,0.1,0]
[null,null,null,null,null,null,"Transport",0.09,{"$f":"overall4","v":0},null,null,null,0.1,0.11]
[null,null,null,null,null,null,"Vatten",7.0000000000000007E-2,{"$f":"overall5","v":0}]
[null,null,null,null,null,null,"Material",0.14000000000000001,{"$f":"overall6","v":0}]
[null,null,null,null,null,null,"Avfall",0.08,{"$f":"overall7","v":0}]
[null,null,null,null,null,null,"Mark och ekologi",0,{"$f":"overall8","v":0}]
[null,null,null,null,null,null,"Föroreningar",0.11,{"$f":"overall9","v":0}]
[null,null,null,null,null,null,"Innovation",0.1,{"$f":"H34","v":0}]

{"sheet":"Schedule of Changes","index":4,"n_rows":12,"n_cols":10,"rows_kept":12,"cut":false,"hidden":false,"merged":[[2,7,2,9]]}
[null,"Schedule of Changes to the BREEAM SE Assessor Spreadsheet tool"]
[]
[null,null,null,null,null,null,"Applicable BREEAM Europe Scheme","Tillgängliga verksamheter i BREEAMSE "]
[null,null,"Previous rev no.","New rev. No.","Date","Beskrivning ","Toyota","Industri","Kontor","Handel"]
[null,null,null,"Version 1","140528","Första utkast till Sverigemarknaden.",null,"Ja","Ja","Ja"]
[null,null,"Version 1","Version 2","140704","Reviderat Pol1, omfång texter, Hea 13 & 15, Wst 6 samt Pol 5. Ändrat text \"Notes\" till Anteckningar/Kommentarer",null,"Ja","Ja","Ja"]
[null,null,"Version 2","Version 3","141012","korrigerat rapporterade fel, justerat if-satser övergripande.",null,"Ja","Ja","Ja"]
[null,null,"Version 3","Version 5","141215","Dialog med BRE, korrigerat rapporterade fel",null,"Ja","Ja","Ja"]
[null,null,"Version 5","Version 6","150921","Korrigerat räkneverk avseende minimikrav",null,"Ja","Ja","Ja"]
[null,null,"Version 6","Version 7","160321","Korrigerat beräkning för industrier (<500 kvm kontor) för Hea 13.",null,"Ja","Ja","Ja"]
[null,null,"Version 7","Version 8","160530","Reviderat rubriker",null,"Ja","Ja","Ja"]
[null,null,"Version 8","Version 9","171004","Korrigerat beräkningar för inredning och kombinerade ny- och ombyggnader.",null,"Ja","Ja","Ja"]